BDBM50128662 1-Ethyl-4-(4-methoxy-benzenesulfonyl)-piperidine-4-carboxylic acid hydroxyamide::1-ethyl-N-hydroxy-4-(4-methoxyphenylsulfonyl)piperidine-4-carboxamide::CHEMBL310342
SMILES: CCN1CCC(CC1)(C(=O)NO)S(=O)(=O)c1ccc(OC)cc1
InChI Key: InChIKey=MWFBMGWABXFCCK-UHFFFAOYSA-N
Data: 3 IC50
Activity Spreadsheet -- Enzyme Inhibition Constant Data from BindingDB
Found 3 hits for monomerid = 50128662
Trg + Lig
Ki
nM
ΔG°
kcal/mole
IC50
nM
Kd
nM
EC50/IC50
nM
koff
s-1
kon
M-1s-1
pHTemp
°C
Collagenase 3
(Homo sapiens (Human))
BDBM50128662
(1-Ethyl-4-(4-methoxy-benzenesulfonyl)-piperidine-4...)
Show SMILES CCN1CCC(CC1)(C(=O)NO)S(=O)(=O)c1ccc(OC)cc1
Show InChI InChI=1S/C15H22N2O5S/c1-3-17-10-8-15(9-11-17,14(18)16-19)23(20,21)13-6-4-12(22-2)5-7-13/h4-7,19H,3,8-11H2,1-2H3,(H,16,18)
NCI pathway
Reactome pathway
n/an/a 33n/an/an/an/an/an/a
Wyeth Research
Curated by ChEMBL
Assay Description
In vitro inhibitory activity against matrix metalloprotease-13.
J Med Chem 46: 2376-96 (2003)
Article DOI: 10.1021/jm0205550
BindingDB Entry DOI: 10.7270/Q2N0178C
Interstitial collagenase
(Homo sapiens (Human))
BDBM50128662
(1-Ethyl-4-(4-methoxy-benzenesulfonyl)-piperidine-4...)
Show SMILES CCN1CCC(CC1)(C(=O)NO)S(=O)(=O)c1ccc(OC)cc1
Show InChI InChI=1S/C15H22N2O5S/c1-3-17-10-8-15(9-11-17,14(18)16-19)23(20,21)13-6-4-12(22-2)5-7-13/h4-7,19H,3,8-11H2,1-2H3,(H,16,18)
Reactome pathway
n/an/a 3.68E+3n/an/an/an/an/an/a
Wyeth Research
Curated by ChEMBL
Assay Description
In vitro inhibitory activity against matrix metalloprotease-1
J Med Chem 46: 2376-96 (2003)
Article DOI: 10.1021/jm0205550
BindingDB Entry DOI: 10.7270/Q2N0178C
Matrix metalloproteinase-9
(Homo sapiens (Human))
BDBM50128662
(1-Ethyl-4-(4-methoxy-benzenesulfonyl)-piperidine-4...)
Show SMILES CCN1CCC(CC1)(C(=O)NO)S(=O)(=O)c1ccc(OC)cc1
Show InChI InChI=1S/C15H22N2O5S/c1-3-17-10-8-15(9-11-17,14(18)16-19)23(20,21)13-6-4-12(22-2)5-7-13/h4-7,19H,3,8-11H2,1-2H3,(H,16,18)
Reactome pathway
n/an/a 364n/an/an/an/an/an/a
Wyeth Research
Curated by ChEMBL
Assay Description
In vitro inhibitory activity against matrix metalloprotease-9.
J Med Chem 46: 2376-96 (2003)
Article DOI: 10.1021/jm0205550
BindingDB Entry DOI: 10.7270/Q2N0178C