BDBM50129127 CHEMBL3629244
SMILES: [H][C@@]12C[C@H](O)[C@H](O)C(=O)\C=C\C[C@H](C)OC(=O)c3c(O)cc(OC)cc3[C@@]1([H])O2
InChI Key: InChIKey=SSNQAUBBJYCSMY-FZVFXEOBSA-N
Data: 1 IC50
Activity Spreadsheet -- Enzyme Inhibition Constant Data from BindingDB
Found 1 hit for monomerid = 50129127
Trg + Lig
Ki
nM
ΔG°
kcal/mole
IC50
nM
Kd
nM
EC50/IC50
nM
koff
s-1
kon
M-1s-1
pHTemp
°C
Mitogen-activated protein kinase kinase kinase 7
(Homo sapiens (Human))
BDBM50129127
(CHEMBL3629244)
Show SMILES [H][C@@]12C[C@H](O)[C@H](O)C(=O)\C=C\C[C@H](C)OC(=O)c3c(O)cc(OC)cc3[C@@]1([H])O2 |r,t:9|
Show InChI InChI=1S/C19H22O8/c1-9-4-3-5-12(20)17(23)14(22)8-15-18(27-15)11-6-10(25-2)7-13(21)16(11)19(24)26-9/h3,5-7,9,14-15,17-18,21-23H,4,8H2,1-2H3/b5-3+/t9-,14-,15+,17+,18+/m0/s1
Reactome pathway
n/an/a 990n/an/an/an/an/an/a
University of North Carolina at Greensboro
Curated by ChEMBL
Assay Description
Inhibition of TAK1 (unknown origin)
Bioorg Med Chem 23: 6993-9 (2015)
BindingDB Entry DOI: 10.7270/Q25D8TNS