BDBM50129516 CHEMBL71918::N-[2-(3,4-Dichloro-phenyl)-4-piperidin-1-yl-butyl]-N-methyl-benzamide
SMILES: CN(CC(CCN1CCCCC1)c1ccc(Cl)c(Cl)c1)C(=O)c1ccccc1
InChI Key: InChIKey=YIJOFUDGMDRJCT-UHFFFAOYSA-N
Data: 1 IC50
Activity Spreadsheet -- Enzyme Inhibition Constant Data from BindingDB
Found 1 hit for monomerid = 50129516
Trg + Lig
Ki
nM
ΔG°
kcal/mole
IC50
nM
Kd
nM
EC50/IC50
nM
koff
s-1
kon
M-1s-1
pHTemp
°C
Neurokinin 2 receptor
(Homo sapiens (Human))
BDBM50129516
(CHEMBL71918 | N-[2-(3,4-Dichloro-phenyl)-4-piperid...)
Show SMILES CN(CC(CCN1CCCCC1)c1ccc(Cl)c(Cl)c1)C(=O)c1ccccc1
Show InChI InChI=1S/C23H28Cl2N2O/c1-26(23(28)18-8-4-2-5-9-18)17-20(12-15-27-13-6-3-7-14-27)19-10-11-21(24)22(25)16-19/h2,4-5,8-11,16,20H,3,6-7,12-15,17H2,1H3
Reactome pathway
n/an/a 6.30n/an/an/an/an/an/a
Pfizer Global Research and Development
Curated by ChEMBL
Assay Description
Binding affinity for human tachykinin receptor 2 expressed in CHO cells using [125I]- NKA radioligand
Bioorg Med Chem Lett 13: 2211-5 (2003)
BindingDB Entry DOI: 10.7270/Q2D799TN