BDBM50129566 (2S,5R,6R)-2'-(tert-Butyl-dimethyl-silanyl-oxy)-3,3-dimethyl-7-oxo-4-thia-1-azaspiro[bicyclo[3.2.0]heptane-6,1'-cyclopropane]-2-carboxylic acid 4,4-dioxide::CHEMBL314223
SMILES: CC(C)(C)[Si](C)(C)O[C@H]1C[C@@]11[C@@H]2N([C@@H](C(O)=O)C(C)(C)S2(=O)=O)C1=O
InChI Key: InChIKey=DLHDQLOBEVYACK-RRUOHSGJSA-N
Data: 2 IC50
Activity Spreadsheet -- Enzyme Inhibition Constant Data from BindingDB
Found 2 hits for monomerid = 50129566
Trg + Lig
Ki
nM
ΔG°
kcal/mole
IC50
nM
Kd
nM
EC50/IC50
nM
koff
s-1
kon
M-1s-1
pHTemp
°C
Beta-lactamase
(Enterobacter cloacae)
BDBM50129566
((2S,5R,6R)-2'-(tert-Butyl-dimethyl-silanyl-oxy)-3,...)
Show SMILES CC(C)(C)[Si](C)(C)O[C@H]1C[C@@]11[C@@H]2N([C@@H](C(O)=O)C(C)(C)S2(=O)=O)C1=O
Show InChI InChI=1S/C16H27NO6SSi/c1-14(2,3)25(6,7)23-9-8-16(9)12(20)17-10(11(18)19)15(4,5)24(21,22)13(16)17/h9-10,13H,8H2,1-7H3,(H,18,19)/t9-,10-,13+,16+/m0/s1
n/an/a 650n/an/an/an/an/an/a
Wyeth Research
Curated by ChEMBL
Assay Description
In vitro inhibitory activity against Beta-lactamase TEM-1 of class A enzyme
J Med Chem 46: 2569-71 (2003)
Article DOI: 10.1021/jm034056q
BindingDB Entry DOI: 10.7270/Q2W66K59
Beta-lactamase
(Enterobacter cloacae)
BDBM50129566
((2S,5R,6R)-2'-(tert-Butyl-dimethyl-silanyl-oxy)-3,...)
Show SMILES CC(C)(C)[Si](C)(C)O[C@H]1C[C@@]11[C@@H]2N([C@@H](C(O)=O)C(C)(C)S2(=O)=O)C1=O
Show InChI InChI=1S/C16H27NO6SSi/c1-14(2,3)25(6,7)23-9-8-16(9)12(20)17-10(11(18)19)15(4,5)24(21,22)13(16)17/h9-10,13H,8H2,1-7H3,(H,18,19)/t9-,10-,13+,16+/m0/s1
n/an/a 20n/an/an/an/an/an/a
Wyeth Research
Curated by ChEMBL
Assay Description
In vitro inhibitory activity against Beta-lactamase AmpC of class C enzyme
J Med Chem 46: 2569-71 (2003)
Article DOI: 10.1021/jm034056q
BindingDB Entry DOI: 10.7270/Q2W66K59