BDBM50129635 3-Formylamino-pyridine-2-carboxylic acid thiazol-2-ylamide::CHEMBL91372
SMILES: O=CNc1cccnc1C(=O)Nc1nccs1
InChI Key: InChIKey=MQYYXMYJZFLBKW-UHFFFAOYSA-N
Data: 2 IC50
Activity Spreadsheet -- Enzyme Inhibition Constant Data from BindingDB
Found 2 hits for monomerid = 50129635
Trg + Lig
Ki
nM
ΔG°
kcal/mole
IC50
nM
Kd
nM
EC50/IC50
nM
koff
s-1
kon
M-1s-1
pHTemp
°C
Methionine Aminopeptidase (MAP)
(Escherichia coli (strain K12))
BDBM50129635
(3-Formylamino-pyridine-2-carboxylic acid thiazol-2...)
Show SMILES O=CNc1cccnc1C(=O)Nc1nccs1
Show InChI InChI=1S/C10H8N4O2S/c15-6-13-7-2-1-3-11-8(7)9(16)14-10-12-4-5-17-10/h1-6H,(H,13,15)(H,12,14,16)
n/an/a 330n/an/an/an/an/an/a
Chinese Academy of Sciences
Curated by ChEMBL
Assay Description
Inhibitory activity against Methionine aminopeptidase 1 from Escherichia coli
J Med Chem 46: 2631-40 (2003)
Article DOI: 10.1021/jm0300532
BindingDB Entry DOI: 10.7270/Q2CF9QTC
Methionine aminopeptidase 1
(Saccharomyces cerevisiae)
BDBM50129635
(3-Formylamino-pyridine-2-carboxylic acid thiazol-2...)
Show SMILES O=CNc1cccnc1C(=O)Nc1nccs1
Show InChI InChI=1S/C10H8N4O2S/c15-6-13-7-2-1-3-11-8(7)9(16)14-10-12-4-5-17-10/h1-6H,(H,13,15)(H,12,14,16)
Reactome pathway
n/an/a 320n/an/an/an/an/an/a
Chinese Academy of Sciences
Curated by ChEMBL
Assay Description
Inhibitory activity against type I methionine aminopeptidase from Saccharomyces cerevisiae
J Med Chem 46: 2631-40 (2003)
Article DOI: 10.1021/jm0300532
BindingDB Entry DOI: 10.7270/Q2CF9QTC