BDBM50129641 2-Methyl-but-2-enoic acid 2-(thiazol-2-ylcarbamoyl)-pyridin-3-yl ester::CHEMBL88865
SMILES: C\C=C(/C)C(=O)Oc1cccnc1C(=O)Nc1nccs1
InChI Key: InChIKey=QRBGTXXRRJHTFP-YCRREMRBSA-N
Data: 2 IC50
Activity Spreadsheet -- Enzyme Inhibition Constant Data from BindingDB
Found 2 hits for monomerid = 50129641
Trg + Lig
Ki
nM
ΔG°
kcal/mole
IC50
nM
Kd
nM
EC50/IC50
nM
koff
s-1
kon
M-1s-1
pHTemp
°C
Methionine aminopeptidase 1
(Saccharomyces cerevisiae)
BDBM50129641
(2-Methyl-but-2-enoic acid 2-(thiazol-2-ylcarbamoyl...)
Show SMILES C\C=C(/C)C(=O)Oc1cccnc1C(=O)Nc1nccs1
Show InChI InChI=1S/C14H13N3O3S/c1-3-9(2)13(19)20-10-5-4-6-15-11(10)12(18)17-14-16-7-8-21-14/h3-8H,1-2H3,(H,16,17,18)/b9-3+
Reactome pathway
n/an/a 390n/an/an/an/an/an/a
Chinese Academy of Sciences
Curated by ChEMBL
Assay Description
Inhibitory activity against type I methionine aminopeptidase from Saccharomyces cerevisiae
J Med Chem 46: 2631-40 (2003)
Article DOI: 10.1021/jm0300532
BindingDB Entry DOI: 10.7270/Q2CF9QTC
Methionine Aminopeptidase (MAP)
(Escherichia coli (strain K12))
BDBM50129641
(2-Methyl-but-2-enoic acid 2-(thiazol-2-ylcarbamoyl...)
Show SMILES C\C=C(/C)C(=O)Oc1cccnc1C(=O)Nc1nccs1
Show InChI InChI=1S/C14H13N3O3S/c1-3-9(2)13(19)20-10-5-4-6-15-11(10)12(18)17-14-16-7-8-21-14/h3-8H,1-2H3,(H,16,17,18)/b9-3+
n/an/a 4.40E+3n/an/an/an/an/an/a
Chinese Academy of Sciences
Curated by ChEMBL
Assay Description
Inhibitory activity against Methionine aminopeptidase 1 from Escherichia coli
J Med Chem 46: 2631-40 (2003)
Article DOI: 10.1021/jm0300532
BindingDB Entry DOI: 10.7270/Q2CF9QTC