BDBM50129649 CHEMBL315098::Cyclohexanecarboxylic acid 2-(thiazol-2-ylcarbamoyl)-pyridin-3-yl ester
SMILES: O=C(Oc1cccnc1C(=O)Nc1nccs1)C1CCCCC1
InChI Key: InChIKey=MLHUZNTWTGOAHV-UHFFFAOYSA-N
Data: 2 IC50
Activity Spreadsheet -- Enzyme Inhibition Constant Data from BindingDB
Found 2 hits for monomerid = 50129649
Trg + Lig
Ki
nM
ΔG°
kcal/mole
IC50
nM
Kd
nM
EC50/IC50
nM
koff
s-1
kon
M-1s-1
pHTemp
°C
Methionine aminopeptidase 1
(Saccharomyces cerevisiae)
BDBM50129649
(CHEMBL315098 | Cyclohexanecarboxylic acid 2-(thiaz...)
Show SMILES O=C(Oc1cccnc1C(=O)Nc1nccs1)C1CCCCC1
Show InChI InChI=1S/C16H17N3O3S/c20-14(19-16-18-9-10-23-16)13-12(7-4-8-17-13)22-15(21)11-5-2-1-3-6-11/h4,7-11H,1-3,5-6H2,(H,18,19,20)
Reactome pathway
n/an/a 320n/an/an/an/an/an/a
Chinese Academy of Sciences
Curated by ChEMBL
Assay Description
Inhibitory activity against type I methionine aminopeptidase from Saccharomyces cerevisiae
J Med Chem 46: 2631-40 (2003)
Article DOI: 10.1021/jm0300532
BindingDB Entry DOI: 10.7270/Q2CF9QTC
Methionine Aminopeptidase (MAP)
(Escherichia coli (strain K12))
BDBM50129649
(CHEMBL315098 | Cyclohexanecarboxylic acid 2-(thiaz...)
Show SMILES O=C(Oc1cccnc1C(=O)Nc1nccs1)C1CCCCC1
Show InChI InChI=1S/C16H17N3O3S/c20-14(19-16-18-9-10-23-16)13-12(7-4-8-17-13)22-15(21)11-5-2-1-3-6-11/h4,7-11H,1-3,5-6H2,(H,18,19,20)
n/an/a 2.39E+3n/an/an/an/an/an/a
Chinese Academy of Sciences
Curated by ChEMBL
Assay Description
Inhibitory activity against Methionine aminopeptidase 1 from Escherichia coli
J Med Chem 46: 2631-40 (2003)
Article DOI: 10.1021/jm0300532
BindingDB Entry DOI: 10.7270/Q2CF9QTC