null
SMILES: CCOC(=O)Nc1ccc(Nc2ncnc3sc4CCCCc4c23)cc1C
InChI Key: InChIKey=MLTVDTBSGMYDAA-UHFFFAOYSA-N
Activity Spreadsheet -- Enzyme Inhibition Constant Data from BindingDB
Found 2 hits for monomerid = 50129827
Trg + Lig
Ki
nM
ΔG°
kcal/mole
IC50
nM
Kd
nM
EC50/IC50
nM
koff
s-1
kon
M-1s-1
pHTemp
°C
Vascular endothelial growth factor receptor 2
(Homo sapiens (Human))
BDBM50129827
(CHEMBL3628795)
Show SMILES CCOC(=O)Nc1ccc(Nc2ncnc3sc4CCCCc4c23)cc1C
Show InChI InChI=1S/C20H22N4O2S/c1-3-26-20(25)24-15-9-8-13(10-12(15)2)23-18-17-14-6-4-5-7-16(14)27-19(17)22-11-21-18/h8-11H,3-7H2,1-2H3,(H,24,25)(H,21,22,23)
NCI pathway
Reactome pathway
n/an/a 3.14E+3n/an/an/an/an/an/a
Univ. Lille
Curated by ChEMBL
Assay Description
Inhibition of human recombinant VEGFR-2 after 1 hr using [gamma-32P]ATP
Bioorg Med Chem 23: 7340-7 (2015)
Article DOI: 10.1016/j.bmc.2015.10.035
BindingDB Entry DOI: 10.7270/Q2BZ67VR
Epidermal growth factor receptor
(Homo sapiens (Human))
BDBM50129827
(CHEMBL3628795)
Show SMILES CCOC(=O)Nc1ccc(Nc2ncnc3sc4CCCCc4c23)cc1C
Show InChI InChI=1S/C20H22N4O2S/c1-3-26-20(25)24-15-9-8-13(10-12(15)2)23-18-17-14-6-4-5-7-16(14)27-19(17)22-11-21-18/h8-11H,3-7H2,1-2H3,(H,24,25)(H,21,22,23)
n/an/a>1.00E+4n/an/an/an/an/an/a
Univ. Lille
Curated by ChEMBL
Assay Description
Inhibition of human EGFR after 1 hr using [gamma-32P]ATP
Bioorg Med Chem 23: 7340-7 (2015)
Article DOI: 10.1016/j.bmc.2015.10.035
BindingDB Entry DOI: 10.7270/Q2BZ67VR