BDBM50129907 CHEMBL95093::Cyclohexyl-carbamic acid 3-[2-(2-cyano-pyrrolidin-1-yl)-2-oxo-ethylamino]-adamantan-1-yl ester
SMILES: O=C(NC1CCCCC1)O[C@]12C[C@H]3C[C@H](CC(C3)(C1)NCC(=O)N1CCC[C@H]1C#N)C2
InChI Key: InChIKey=XYDIMJKWPZRNMO-FNWKTZDXSA-N
Data: 1 IC50
Activity Spreadsheet -- Enzyme Inhibition Constant Data from BindingDB
Found 1 hit for monomerid = 50129907
Trg + Lig
Ki
nM
ΔG°
kcal/mole
IC50
nM
Kd
nM
EC50/IC50
nM
koff
s-1
kon
M-1s-1
pHTemp
°C
Dipeptidyl peptidase 4
(Homo sapiens (Human))
BDBM50129907
(CHEMBL95093 | Cyclohexyl-carbamic acid 3-[2-(2-cya...)
Show SMILES O=C(NC1CCCCC1)O[C@]12C[C@H]3C[C@H](CC(C3)(C1)NCC(=O)N1CCC[C@H]1C#N)C2 |TLB:30:10:17:14.15.13,13:14:18:12.17.11,THB:30:14:17:10.18.11,13:12:18:14.15.30|
Show InChI InChI=1S/C24H36N4O3/c25-14-20-7-4-8-28(20)21(29)15-26-23-10-17-9-18(11-23)13-24(12-17,16-23)31-22(30)27-19-5-2-1-3-6-19/h17-20,26H,1-13,15-16H2,(H,27,30)/t17-,18+,20-,23?,24-/m0/s1
Reactome pathway
n/an/a 64n/an/an/an/an/an/a
Novartis Institute for Biomedical Research
Curated by ChEMBL
Assay Description
Inhibition of human dipeptidyl peptidase IV (DPP IV) obtained from human colonic carcinoma cells
J Med Chem 46: 2774-89 (2003)
Article DOI: 10.1021/jm030091l
BindingDB Entry DOI: 10.7270/Q20001HR