BDBM50130025 7-(2-Methyl-pyridin-4-ylmethyl)-8-oxo-2-(pyrazin-2-ylmethoxy)-5-(3,4,5-trimethoxy-phenyl)-7,8-dihydro-[1,7]naphthyridine-6-carboxylic acid methyl ester; hydrochloride::CHEMBL541822
SMILES: COC(=O)c1c(-c2cc(OC)c(OC)c(OC)c2)c2ccc(OCc3cnccn3)nc2c(=O)n1Cc1ccnc(C)c1
InChI Key: InChIKey=FENVFMZRDCOGKP-UHFFFAOYSA-N
Data: 3 IC50
Activity Spreadsheet -- Enzyme Inhibition Constant Data from BindingDB
Found 3 hits for monomerid = 50130025
Trg + Lig
Ki
nM
ΔG°
kcal/mole
IC50
nM
Kd
nM
EC50/IC50
nM
koff
s-1
kon
M-1s-1
pHTemp
°C
cGMP-specific 3',5'-cyclic phosphodiesterase
(Canis lupus familiaris)
BDBM50130025
(7-(2-Methyl-pyridin-4-ylmethyl)-8-oxo-2-(pyrazin-2...)
Show SMILES COC(=O)c1c(-c2cc(OC)c(OC)c(OC)c2)c2ccc(OCc3cnccn3)nc2c(=O)n1Cc1ccnc(C)c1
Show InChI InChI=1S/C31H29N5O7/c1-18-12-19(8-9-33-18)16-36-28(31(38)42-5)26(20-13-23(39-2)29(41-4)24(14-20)40-3)22-6-7-25(35-27(22)30(36)37)43-17-21-15-32-10-11-34-21/h6-15H,16-17H2,1-5H3
Reactome pathway
n/an/a 0.290n/an/an/an/an/an/a
Tanabe Seiyaku Co., Ltd.
Curated by ChEMBL
Assay Description
Inhibitory activity against phosphodiesterase 5 (PDE5) isolated from canine lung
Bioorg Med Chem Lett 13: 2341-5 (2003)
BindingDB Entry DOI: 10.7270/Q2WQ04B2
Phosphodiesterase 1
(Homo sapiens (Human))
BDBM50130025
(7-(2-Methyl-pyridin-4-ylmethyl)-8-oxo-2-(pyrazin-2...)
Show SMILES COC(=O)c1c(-c2cc(OC)c(OC)c(OC)c2)c2ccc(OCc3cnccn3)nc2c(=O)n1Cc1ccnc(C)c1
Show InChI InChI=1S/C31H29N5O7/c1-18-12-19(8-9-33-18)16-36-28(31(38)42-5)26(20-13-23(39-2)29(41-4)24(14-20)40-3)22-6-7-25(35-27(22)30(36)37)43-17-21-15-32-10-11-34-21/h6-15H,16-17H2,1-5H3
n/an/a 2.20E+4n/an/an/an/an/an/a
Tanabe Seiyaku Co., Ltd.
Curated by ChEMBL
Assay Description
Inhibitory activity against phosphodiesterase-1 (PDE1) isolated from canine lung
Bioorg Med Chem Lett 13: 2341-5 (2003)
BindingDB Entry DOI: 10.7270/Q2WQ04B2
Phosphodiesterase 6
(Bos taurus-Bos taurus (Bovine))
BDBM50130025
(7-(2-Methyl-pyridin-4-ylmethyl)-8-oxo-2-(pyrazin-2...)
Show SMILES COC(=O)c1c(-c2cc(OC)c(OC)c(OC)c2)c2ccc(OCc3cnccn3)nc2c(=O)n1Cc1ccnc(C)c1
Show InChI InChI=1S/C31H29N5O7/c1-18-12-19(8-9-33-18)16-36-28(31(38)42-5)26(20-13-23(39-2)29(41-4)24(14-20)40-3)22-6-7-25(35-27(22)30(36)37)43-17-21-15-32-10-11-34-21/h6-15H,16-17H2,1-5H3
n/an/a 7.70n/an/an/an/an/an/a
Tanabe Seiyaku Co., Ltd.
Curated by ChEMBL
Assay Description
Inhibitory activity against Phosphodiesterase 6 isolated from bovine retina
Bioorg Med Chem Lett 13: 2341-5 (2003)
BindingDB Entry DOI: 10.7270/Q2WQ04B2