BDBM50130380 2-[3-(3-Ethyl-azepan-3-yl)-phenoxy]-4-imidazol-1-ylmethyl-benzonitrile::CHEMBL320892
SMILES: CCC1(CCCCNC1)c1cccc(Oc2cc(Cn3ccnc3)ccc2C#N)c1
InChI Key: InChIKey=LQJGIUPYFFXRBB-UHFFFAOYSA-N
Data: 2 IC50
Activity Spreadsheet -- Enzyme Inhibition Constant Data from BindingDB
Found 2 hits for monomerid = 50130380
Trg + Lig
Ki
nM
ΔG°
kcal/mole
IC50
nM
Kd
nM
EC50/IC50
nM
koff
s-1
kon
M-1s-1
pHTemp
°C
Geranylgeranyl transferase type I beta subunit/Protein Farnesyltransferase (PFT)
(Homo sapiens (Human))
BDBM50130380
(2-[3-(3-Ethyl-azepan-3-yl)-phenoxy]-4-imidazol-1-y...)
Show SMILES CCC1(CCCCNC1)c1cccc(Oc2cc(Cn3ccnc3)ccc2C#N)c1
Show InChI InChI=1S/C25H28N4O/c1-2-25(10-3-4-11-27-18-25)22-6-5-7-23(15-22)30-24-14-20(8-9-21(24)16-26)17-29-13-12-28-19-29/h5-9,12-15,19,27H,2-4,10-11,17-18H2,1H3
n/an/a 280n/an/an/an/an/an/a
Merck Research Laboratories
Curated by ChEMBL
Assay Description
Concentration required to inhibit recombinant human geranylgeranyl transferase type I (GGTase-I) catalyzed incorporation of [3H]GGPP to the C-terminu...
J Med Chem 46: 2973-84 (2003)
Article DOI: 10.1021/jm020587n
BindingDB Entry DOI: 10.7270/Q26Q1Z0P
Protein Farnesyltransferase (PFT)
(Homo sapiens (Human))
BDBM50130380
(2-[3-(3-Ethyl-azepan-3-yl)-phenoxy]-4-imidazol-1-y...)
Show SMILES CCC1(CCCCNC1)c1cccc(Oc2cc(Cn3ccnc3)ccc2C#N)c1
Show InChI InChI=1S/C25H28N4O/c1-2-25(10-3-4-11-27-18-25)22-6-5-7-23(15-22)30-24-14-20(8-9-21(24)16-26)17-29-13-12-28-19-29/h5-9,12-15,19,27H,2-4,10-11,17-18H2,1H3
Reactome pathway
n/an/a 100n/an/an/an/an/an/a
Merck Research Laboratories
Curated by ChEMBL
Assay Description
Concentration required to inhibit recombinant human farnesyltransferase (FTase) catalyzed incorporation of [3H]FPP into recombinant Ras-CVIM.
J Med Chem 46: 2973-84 (2003)
Article DOI: 10.1021/jm020587n
BindingDB Entry DOI: 10.7270/Q26Q1Z0P