BDBM50130410 CHEMBL3633690
SMILES: CCS(=O)(=O)c1ccc(OC)c(Nc2cn(nn2)-c2ccc(O)c(c2)-c2cc[nH]c2)c1
InChI Key: InChIKey=ZXGGCVUGFURVIA-UHFFFAOYSA-N
Data: 1 IC50
Activity Spreadsheet -- Enzyme Inhibition Constant Data from BindingDB
Found 1 hit for monomerid = 50130410
Trg + Lig
Ki
nM
ΔG°
kcal/mole
IC50
nM
Kd
nM
EC50/IC50
nM
koff
s-1
kon
M-1s-1
pHTemp
°C
Vascular endothelial growth factor receptor 2
(Homo sapiens (Human))
BDBM50130410
(CHEMBL3633690)
Show SMILES CCS(=O)(=O)c1ccc(OC)c(Nc2cn(nn2)-c2ccc(O)c(c2)-c2cc[nH]c2)c1
Show InChI InChI=1S/C21H21N5O4S/c1-3-31(28,29)16-5-7-20(30-2)18(11-16)23-21-13-26(25-24-21)15-4-6-19(27)17(10-15)14-8-9-22-12-14/h4-13,22-23,27H,3H2,1-2H3
NCI pathway
Reactome pathway
n/an/a 4.01E+4n/an/an/an/an/an/a
Universit£ de Strasbourg
Curated by ChEMBL
Assay Description
Inhibition of GST-tagged human recombinant VEGFR2 kinase expressed in Sf9 insect cells by radiometric protein kinase assay
Eur J Med Chem 103: 105-22 (2015)
BindingDB Entry DOI: 10.7270/Q2P84DQG