BDBM50131198 2-Benzyl-5-(4-methoxy-phenyl)-2H-[1,2,4]triazole-3-thiol::CHEMBL312060
SMILES: COc1ccc(cc1)-c1nn(Cc2ccccc2)c(=S)[nH]1
InChI Key: InChIKey=WBXUXYKEKJBFMR-UHFFFAOYSA-N
Data: 1 IC50
Activity Spreadsheet -- Enzyme Inhibition Constant Data from BindingDB
Found 1 hit for monomerid = 50131198
Trg + Lig
Ki
nM
ΔG°
kcal/mole
IC50
nM
Kd
nM
EC50/IC50
nM
koff
s-1
kon
M-1s-1
pHTemp
°C
C-X-C chemokine receptor type 2
(Homo sapiens (Human))
BDBM50131198
(2-Benzyl-5-(4-methoxy-phenyl)-2H-[1,2,4]triazole-3...)
Show SMILES COc1ccc(cc1)-c1nn(Cc2ccccc2)c(=S)[nH]1
Show InChI InChI=1S/C16H15N3OS/c1-20-14-9-7-13(8-10-14)15-17-16(21)19(18-15)11-12-5-3-2-4-6-12/h2-10H,11H2,1H3,(H,17,18,21)
Reactome pathway
n/an/a 2.30E+3n/an/an/an/an/an/a
AstraZeneca R&D Charnwood
Curated by ChEMBL
Assay Description
Inhibition of binding of [125I]-IL8 to human recombinant CXC chemokine receptor 2 (CXCR2) expressed in HEK 293 membranes
Bioorg Med Chem Lett 13: 2625-8 (2003)
BindingDB Entry DOI: 10.7270/Q2B56J5K