BDBM50131206 2-Benzyl-5-thiophen-2-yl-2H-[1,2,4]triazole-3-thiol::CHEMBL86001
SMILES: S=c1[nH]c(nn1Cc1ccccc1)-c1cccs1
InChI Key: InChIKey=VUKQIJQKNREKTO-UHFFFAOYSA-N
Data: 1 IC50
Activity Spreadsheet -- Enzyme Inhibition Constant Data from BindingDB
Found 1 hit for monomerid = 50131206
Trg + Lig
Ki
nM
ΔG°
kcal/mole
IC50
nM
Kd
nM
EC50/IC50
nM
koff
s-1
kon
M-1s-1
pHTemp
°C
C-X-C chemokine receptor type 2
(Homo sapiens (Human))
BDBM50131206
(2-Benzyl-5-thiophen-2-yl-2H-[1,2,4]triazole-3-thio...)
Show SMILES S=c1[nH]c(nn1Cc1ccccc1)-c1cccs1
Show InChI InChI=1S/C13H11N3S2/c17-13-14-12(11-7-4-8-18-11)15-16(13)9-10-5-2-1-3-6-10/h1-8H,9H2,(H,14,15,17)
Reactome pathway
n/an/a 2.00E+3n/an/an/an/an/an/a
AstraZeneca R&D Charnwood
Curated by ChEMBL
Assay Description
Inhibition of binding of [125I]-IL8 to human recombinant CXC chemokine receptor 2 (CXCR2) expressed in HEK 293 membranes
Bioorg Med Chem Lett 13: 2625-8 (2003)
BindingDB Entry DOI: 10.7270/Q2B56J5K