BDBM50131300 (R)-2-[2-(Formyl-hydroxy-amino)-ethyl]-hexanoic acid ((S)-1-dimethylcarbamoyl-2,2-dimethyl-propyl)-amide::CHEMBL93365
SMILES: CCCC[C@H](CCN(O)C=O)C(=O)N[C@H](C(=O)N(C)C)C(C)(C)C
InChI Key: InChIKey=QBQPXRKMZSXKAH-ZIAGYGMSSA-N
Data: 1 IC50
Activity Spreadsheet -- Enzyme Inhibition Constant Data from BindingDB
Found 1 hit for monomerid = 50131300
Trg + Lig
Ki
nM
ΔG°
kcal/mole
IC50
nM
Kd
nM
EC50/IC50
nM
koff
s-1
kon
M-1s-1
pHTemp
°C
Peptide deformylase mitochondrial
(Homo sapiens (Human))
BDBM50131300
((R)-2-[2-(Formyl-hydroxy-amino)-ethyl]-hexanoic ac...)
Show SMILES CCCC[C@H](CCN(O)C=O)C(=O)N[C@H](C(=O)N(C)C)C(C)(C)C
Show InChI InChI=1S/C17H33N3O4/c1-7-8-9-13(10-11-20(24)12-21)15(22)18-14(17(2,3)4)16(23)19(5)6/h12-14,24H,7-11H2,1-6H3,(H,18,22)/t13-,14-/m1/s1
n/an/a 1.00E+3n/an/an/an/an/an/a
British Biotech Pharmaceuticals Limited
Curated by ChEMBL
Assay Description
Inhibition against Escherichia coli peptide deformylase
Bioorg Med Chem Lett 13: 2709-13 (2003)
BindingDB Entry DOI: 10.7270/Q2XW4J6S