BDBM50131303 (S)-2-[(R)-2-Cyclohexylmethyl-3-(formyl-hydroxy-amino)-propionylamino]-3,3,N,N-tetramethyl-butyramide::CHEMBL90193
SMILES: CN(C)C(=O)[C@@H](NC(=O)[C@H](CC1CCCCC1)CN(O)C=O)C(C)(C)C
InChI Key: InChIKey=SKJYHVWCYXUBFQ-HZPDHXFCSA-N
Data: 1 IC50
Activity Spreadsheet -- Enzyme Inhibition Constant Data from BindingDB
Found 1 hit for monomerid = 50131303
Trg + Lig
Ki
nM
ΔG°
kcal/mole
IC50
nM
Kd
nM
EC50/IC50
nM
koff
s-1
kon
M-1s-1
pHTemp
°C
Peptide deformylase mitochondrial
(Homo sapiens (Human))
BDBM50131303
((S)-2-[(R)-2-Cyclohexylmethyl-3-(formyl-hydroxy-am...)
Show SMILES CN(C)C(=O)[C@@H](NC(=O)[C@H](CC1CCCCC1)CN(O)C=O)C(C)(C)C
Show InChI InChI=1S/C19H35N3O4/c1-19(2,3)16(18(25)21(4)5)20-17(24)15(12-22(26)13-23)11-14-9-7-6-8-10-14/h13-16,26H,6-12H2,1-5H3,(H,20,24)/t15-,16-/m1/s1
n/an/a 6n/an/an/an/an/an/a
British Biotech Pharmaceuticals Limited
Curated by ChEMBL
Assay Description
Inhibition against Escherichia coli peptide deformylase
Bioorg Med Chem Lett 13: 2709-13 (2003)
BindingDB Entry DOI: 10.7270/Q2XW4J6S