BDBM50131487 CHEMBL3634881
SMILES: CC(C)(C)c1ccc2c(N)c(C#N)c(N)nc2n1
InChI Key: InChIKey=XZPVVZIVQKHQJZ-UHFFFAOYSA-N
Data: 1 IC50
Activity Spreadsheet -- Enzyme Inhibition Constant Data from BindingDB
Found 1 hit for monomerid = 50131487
Trg + Lig
Ki
nM
ΔG°
kcal/mole
IC50
nM
Kd
nM
EC50/IC50
nM
koff
s-1
kon
M-1s-1
pHTemp
°C
DNA ligase
(Staphylococcus aureus)
BDBM50131487
(CHEMBL3634881)
Show SMILES CC(C)(C)c1ccc2c(N)c(C#N)c(N)nc2n1
Show InChI InChI=1S/C13H15N5/c1-13(2,3)9-5-4-7-10(15)8(6-14)11(16)18-12(7)17-9/h4-5H,1-3H3,(H4,15,16,17,18)
n/an/a<40n/an/an/an/an/an/a
AstraZeneca
Curated by ChEMBL
Assay Description
Inhibition of Staphylococcus aureus NAD(+)-dependent DNA ligase
Bioorg Med Chem Lett 25: 5172-7 (2015)
BindingDB Entry DOI: 10.7270/Q2KD20RN