BDBM50131824 CHEMBL3632724
SMILES: Cc1cnc([nH]1)-c1cc(Oc2ccc3n(C)c(Nc4cc(ccc4F)C(F)(F)F)nc3c2)ccn1
InChI Key: InChIKey=RECKFDASWBRPIB-UHFFFAOYSA-N
Data: 2 IC50
Activity Spreadsheet -- Enzyme Inhibition Constant Data from BindingDB
Found 2 hits for monomerid = 50131824
Trg + Lig
Ki
nM
ΔG°
kcal/mole
IC50
nM
Kd
nM
EC50/IC50
nM
koff
s-1
kon
M-1s-1
pHTemp
°C
Serine/threonine-protein kinase B-raf
(Homo sapiens (Human))
BDBM50131824
(CHEMBL3632724)
Show SMILES Cc1cnc([nH]1)-c1cc(Oc2ccc3n(C)c(Nc4cc(ccc4F)C(F)(F)F)nc3c2)ccn1
Show InChI InChI=1S/C24H18F4N6O/c1-13-12-30-22(31-13)20-11-16(7-8-29-20)35-15-4-6-21-19(10-15)33-23(34(21)2)32-18-9-14(24(26,27)28)3-5-17(18)25/h3-12H,1-2H3,(H,30,31)(H,32,33)
NCI pathway
Reactome pathway
n/an/a 620n/an/an/an/an/an/a
Novartis Institutes for Biomedical Research
Curated by ChEMBL
Assay Description
In vitro inhibitory activity towards Coagulation factor X was determined using chromogenic substrate, MeO-COD-CHG-Gly-Arg-pNA
ACS Med Chem Lett 6: 961-5 (2015)
BindingDB Entry DOI: 10.7270/Q28W3G4S
Cytochrome P450 3A4
(Homo sapiens (Human))
BDBM50131824
(CHEMBL3632724)
Show SMILES Cc1cnc([nH]1)-c1cc(Oc2ccc3n(C)c(Nc4cc(ccc4F)C(F)(F)F)nc3c2)ccn1
Show InChI InChI=1S/C24H18F4N6O/c1-13-12-30-22(31-13)20-11-16(7-8-29-20)35-15-4-6-21-19(10-15)33-23(34(21)2)32-18-9-14(24(26,27)28)3-5-17(18)25/h3-12H,1-2H3,(H,30,31)(H,32,33)
Reactome pathway
n/an/a 3.40E+3n/an/an/an/an/an/a
Novartis Institutes for Biomedical Research
Curated by ChEMBL
Assay Description
Inhibitory activity towards acetylcholine esterase (AChE)
ACS Med Chem Lett 6: 961-5 (2015)
BindingDB Entry DOI: 10.7270/Q28W3G4S