BDBM50132144 5-(4-Chloro-benzyl)-1H-pyrazole-3-carboxylic acid::CHEMBL341520
SMILES: OC(=O)c1cc(Cc2ccc(Cl)cc2)[nH]n1
InChI Key: InChIKey=YKKXGQMJMUSFFP-UHFFFAOYSA-N
Data: 1 KI
Activity Spreadsheet -- Enzyme Inhibition Constant Data from BindingDB
Found 1 hit for monomerid = 50132144
Trg + Lig
Ki
nM
ΔG°
kcal/mole
IC50
nM
Kd
nM
EC50/IC50
nM
koff
s-1
kon
M-1s-1
pHTemp
°C
Hydroxycarboxylic acid receptor 2
(Rattus norvegicus)
BDBM50132144
(5-(4-Chloro-benzyl)-1H-pyrazole-3-carboxylic acid ...)
Show SMILES OC(=O)c1cc(Cc2ccc(Cl)cc2)[nH]n1
Show InChI InChI=1S/C11H9ClN2O2/c12-8-3-1-7(2-4-8)5-9-6-10(11(15)16)14-13-9/h1-4,6H,5H2,(H,13,14)(H,15,16)
Reactome pathway
3.61E+3n/an/an/an/an/an/an/an/a
Leiden/Amsterdam Center for Drug Research
Curated by ChEMBL
Assay Description
Inhibition of [3H]-nicotinic acid (20 nM) binding to nicotinic acid receptor in rat spleen membrane.
J Med Chem 46: 3945-51 (2003)
Article DOI: 10.1021/jm030888c
BindingDB Entry DOI: 10.7270/Q2V988TK