BDBM50132172 3-[(3-Isopropyl-1H-pyrazolo[4,3-d]pyrimidin-7-ylamino)-methyl]-phenol::CHEMBL406022
SMILES: CC(C)c1[nH]nc2c(NCc3cccc(O)c3)ncnc12
InChI Key: InChIKey=SSGCSNJTMUOJGA-UHFFFAOYSA-N
Data: 2 IC50
Activity Spreadsheet -- Enzyme Inhibition Constant Data from BindingDB
Found 2 hits for monomerid = 50132172
Trg + Lig
Ki
nM
ΔG°
kcal/mole
IC50
nM
Kd
nM
EC50/IC50
nM
koff
s-1
kon
M-1s-1
pHTemp
°C
Cyclin B/Cyclin-Dependent Kinase 1 (CDK1)/G2/mitotic-specific cyclin B2/G2/mitotic-specific cyclin B3
(Homo sapiens (Human))
BDBM50132172
(3-[(3-Isopropyl-1H-pyrazolo[4,3-d]pyrimidin-7-ylam...)
Show SMILES CC(C)c1[nH]nc2c(NCc3cccc(O)c3)ncnc12
Show InChI InChI=1S/C15H17N5O/c1-9(2)12-13-14(20-19-12)15(18-8-17-13)16-7-10-4-3-5-11(21)6-10/h3-6,8-9,21H,7H2,1-2H3,(H,19,20)(H,16,17,18)
n/an/a 88n/an/an/an/an/an/a
Academy of Sciences of the Czech Republic
Curated by ChEMBL
Assay Description
Inhibitory concentration against Cyclin-dependent kinase 1-cyclin B
Bioorg Med Chem Lett 13: 2989-92 (2003)
BindingDB Entry DOI: 10.7270/Q29Z948Q
Cyclin B/Cyclin-Dependent Kinase 1 (CDK1)/G2/mitotic-specific cyclin B2/G2/mitotic-specific cyclin B3
(Homo sapiens (Human))
BDBM50132172
(3-[(3-Isopropyl-1H-pyrazolo[4,3-d]pyrimidin-7-ylam...)
Show SMILES CC(C)c1[nH]nc2c(NCc3cccc(O)c3)ncnc12
Show InChI InChI=1S/C15H17N5O/c1-9(2)12-13-14(20-19-12)15(18-8-17-13)16-7-10-4-3-5-11(21)6-10/h3-6,8-9,21H,7H2,1-2H3,(H,19,20)(H,16,17,18)
n/an/a 1.70n/an/an/an/an/an/a
Academy of Sciences of the Czech Republic
Curated by ChEMBL
Assay Description
Inhibitory concentration against Cyclin-dependent kinase 1-cyclin B
Bioorg Med Chem Lett 13: 2989-92 (2003)
BindingDB Entry DOI: 10.7270/Q29Z948Q