BDBM50132185 Benzyl-(3-isopropyl-1H-pyrazolo[4,3-d]pyrimidin-7-yl)-amine::CHEMBL99698
SMILES: CC(C)c1[nH]nc2c(NCc3ccccc3)ncnc12
InChI Key: InChIKey=JWXOBSUVACUIKN-UHFFFAOYSA-N
Data: 2 IC50
Activity Spreadsheet -- Enzyme Inhibition Constant Data from BindingDB
Found 2 hits for monomerid = 50132185
Trg + Lig
Ki
nM
ΔG°
kcal/mole
IC50
nM
Kd
nM
EC50/IC50
nM
koff
s-1
kon
M-1s-1
pHTemp
°C
Cyclin B/Cyclin-Dependent Kinase 1 (CDK1)/G2/mitotic-specific cyclin B2/G2/mitotic-specific cyclin B3
(Homo sapiens (Human))
BDBM50132185
(Benzyl-(3-isopropyl-1H-pyrazolo[4,3-d]pyrimidin-7-...)
Show SMILES CC(C)c1[nH]nc2c(NCc3ccccc3)ncnc12
Show InChI InChI=1S/C15H17N5/c1-10(2)12-13-14(20-19-12)15(18-9-17-13)16-8-11-6-4-3-5-7-11/h3-7,9-10H,8H2,1-2H3,(H,19,20)(H,16,17,18)
n/an/a 66n/an/an/an/an/an/a
Academy of Sciences of the Czech Republic
Curated by ChEMBL
Assay Description
In vitro antiproliferative activity against myeloid leukemia K562 cell line
Bioorg Med Chem Lett 13: 2989-92 (2003)
BindingDB Entry DOI: 10.7270/Q29Z948Q
Cyclin B/Cyclin-Dependent Kinase 1 (CDK1)/G2/mitotic-specific cyclin B2/G2/mitotic-specific cyclin B3
(Homo sapiens (Human))
BDBM50132185
(Benzyl-(3-isopropyl-1H-pyrazolo[4,3-d]pyrimidin-7-...)
Show SMILES CC(C)c1[nH]nc2c(NCc3ccccc3)ncnc12
Show InChI InChI=1S/C15H17N5/c1-10(2)12-13-14(20-19-12)15(18-9-17-13)16-8-11-6-4-3-5-7-11/h3-7,9-10H,8H2,1-2H3,(H,19,20)(H,16,17,18)
n/an/a 1.20n/an/an/an/an/an/a
Academy of Sciences of the Czech Republic
Curated by ChEMBL
Assay Description
In vitro antiproliferative activity against myeloid leukemia K562 cell line
Bioorg Med Chem Lett 13: 2989-92 (2003)
BindingDB Entry DOI: 10.7270/Q29Z948Q