BDBM50132209 4-(7-Nitro-quinazolin-4-yl)-piperazine-1-carboxylic acid (4-phenoxy-phenyl)-amide::CHEMBL100804
SMILES: [O-][N+](=O)c1ccc2c(ncnc2c1)N1CCN(CC1)C(=O)Nc1ccc(Oc2ccccc2)cc1
InChI Key: InChIKey=HNFOSLHDXLGYAL-UHFFFAOYSA-N
Data: 1 IC50
Activity Spreadsheet -- Enzyme Inhibition Constant Data from BindingDB
Found 1 hit for monomerid = 50132209
Trg + Lig
Ki
nM
ΔG°
kcal/mole
IC50
nM
Kd
nM
EC50/IC50
nM
koff
s-1
kon
M-1s-1
pHTemp
°C
Platelet-derived growth factor receptor beta
(Homo sapiens (Human))
BDBM50132209
(4-(7-Nitro-quinazolin-4-yl)-piperazine-1-carboxyli...)
Show SMILES [O-][N+](=O)c1ccc2c(ncnc2c1)N1CCN(CC1)C(=O)Nc1ccc(Oc2ccccc2)cc1
Show InChI InChI=1S/C25H22N6O4/c32-25(28-18-6-9-21(10-7-18)35-20-4-2-1-3-5-20)30-14-12-29(13-15-30)24-22-11-8-19(31(33)34)16-23(22)26-17-27-24/h1-11,16-17H,12-15H2,(H,28,32)
NCI pathway
Reactome pathway
n/an/a 2.90n/an/an/an/an/an/a
Kyowa Hakko Kogyo Co., Ltd.
Curated by ChEMBL
Assay Description
Inhibitory concentration against platelet-derived growth factor receptor beta phosphorylation in CHO cells
Bioorg Med Chem Lett 13: 3001-4 (2003)
BindingDB Entry DOI: 10.7270/Q2668CKR