null
SMILES: CCNc1cc2ncnc(N3CCN(CC3)C(=[SH+])[N-]Cc3ccccc3)c2cc1[N+]([O-])=O
InChI Key: InChIKey=OBOUZRCLEZJSQQ-UHFFFAOYSA-N
Activity Spreadsheet -- Enzyme Inhibition Constant Data from BindingDB
Found 2 hits for monomerid = 50132217
Trg + Lig
Ki
nM
ΔG°
kcal/mole
IC50
nM
Kd
nM
EC50/IC50
nM
koff
s-1
kon
M-1s-1
pHTemp
°C
Platelet-derived growth factor receptor beta
(Homo sapiens (Human))
BDBM50132217
(4-(7-Ethylamino-6-nitro-quinazolin-4-yl)-piperazin...)
Show SMILES CCNc1cc2ncnc(N3CCN(CC3)C(=[SH+])[N-]Cc3ccccc3)c2cc1[N+]([O-])=O
Show InChI InChI=1S/C22H25N7O2S/c1-2-23-19-13-18-17(12-20(19)29(30)31)21(26-15-25-18)27-8-10-28(11-9-27)22(32)24-14-16-6-4-3-5-7-16/h3-7,12-13,15H,2,8-11,14H2,1H3,(H2,23,24,25,26,32)
NCI pathway
Reactome pathway
n/an/a>3.00E+4n/an/an/an/an/an/a
Pharmaceutical Research Institute
Curated by ChEMBL
Assay Description
Inhibition of platelet-derived growth factor receptor beta phosphorylation was measured in intact cells using a two-site enzyme linked immunosorbent ...
J Med Chem 46: 4910-25 (2003)
Article DOI: 10.1021/jm020505v
BindingDB Entry DOI: 10.7270/Q2X929PJ
Platelet-derived growth factor receptor beta
(Homo sapiens (Human))
BDBM50132217
(4-(7-Ethylamino-6-nitro-quinazolin-4-yl)-piperazin...)
Show SMILES CCNc1cc2ncnc(N3CCN(CC3)C(=[SH+])[N-]Cc3ccccc3)c2cc1[N+]([O-])=O
Show InChI InChI=1S/C22H25N7O2S/c1-2-23-19-13-18-17(12-20(19)29(30)31)21(26-15-25-18)27-8-10-28(11-9-27)22(32)24-14-16-6-4-3-5-7-16/h3-7,12-13,15H,2,8-11,14H2,1H3,(H2,23,24,25,26,32)
NCI pathway
Reactome pathway
n/an/a>30n/an/an/an/an/an/a
Kyowa Hakko Kogyo Co., Ltd.
Curated by ChEMBL
Assay Description
Inhibitory concentration against platelet-derived growth factor receptor beta phosphorylation in CHO cells
Bioorg Med Chem Lett 13: 3001-4 (2003)
BindingDB Entry DOI: 10.7270/Q2668CKR