BDBM50132220 4-(6-Ethoxy-7-methoxy-quinazolin-4-yl)-piperazine-1-carbothioic acid benzylamide::CHEMBL100735
SMILES: CCOc1cc2c(ncnc2cc1OC)N1CCN(CC1)C(=S)NCc1ccccc1
InChI Key: InChIKey=KIPNTFREYBTTKV-UHFFFAOYSA-N
Data: 2 IC50
Activity Spreadsheet -- Enzyme Inhibition Constant Data from BindingDB
Found 2 hits for monomerid = 50132220
Trg + Lig
Ki
nM
ΔG°
kcal/mole
IC50
nM
Kd
nM
EC50/IC50
nM
koff
s-1
kon
M-1s-1
pHTemp
°C
Platelet-derived growth factor receptor beta
(Homo sapiens (Human))
BDBM50132220
(4-(6-Ethoxy-7-methoxy-quinazolin-4-yl)-piperazine-...)
Show SMILES CCOc1cc2c(ncnc2cc1OC)N1CCN(CC1)C(=S)NCc1ccccc1
Show InChI InChI=1S/C23H27N5O2S/c1-3-30-21-13-18-19(14-20(21)29-2)25-16-26-22(18)27-9-11-28(12-10-27)23(31)24-15-17-7-5-4-6-8-17/h4-8,13-14,16H,3,9-12,15H2,1-2H3,(H,24,31)
NCI pathway
Reactome pathway
n/an/a 620n/an/an/an/an/an/a
Pharmaceutical Research Institute
Curated by ChEMBL
Assay Description
Inhibition of platelet-derived growth factor receptor beta phosphorylation was measured in intact cells using a two-site enzyme linked immunosorbent ...
J Med Chem 46: 4910-25 (2003)
Article DOI: 10.1021/jm020505v
BindingDB Entry DOI: 10.7270/Q2X929PJ
Platelet-derived growth factor receptor beta
(Homo sapiens (Human))
BDBM50132220
(4-(6-Ethoxy-7-methoxy-quinazolin-4-yl)-piperazine-...)
Show SMILES CCOc1cc2c(ncnc2cc1OC)N1CCN(CC1)C(=S)NCc1ccccc1
Show InChI InChI=1S/C23H27N5O2S/c1-3-30-21-13-18-19(14-20(21)29-2)25-16-26-22(18)27-9-11-28(12-10-27)23(31)24-15-17-7-5-4-6-8-17/h4-8,13-14,16H,3,9-12,15H2,1-2H3,(H,24,31)
NCI pathway
Reactome pathway
n/an/a 0.620n/an/an/an/an/an/a
Kyowa Hakko Kogyo Co., Ltd.
Curated by ChEMBL
Assay Description
Inhibitory concentration against platelet-derived growth factor receptor beta phosphorylation in CHO cells
Bioorg Med Chem Lett 13: 3001-4 (2003)
BindingDB Entry DOI: 10.7270/Q2668CKR