BDBM50132234 CHEMBL103599::N-[4-(4-Benzylthiocarbamoyl-piperazin-1-yl)-7-chloro-quinazolin-6-yl]-acetamide
SMILES: CC(=O)Nc1cc2c(ncnc2cc1Cl)N1CCN(CC1)C(=S)NCc1ccccc1
InChI Key: InChIKey=XYJLQNMUEAJOTN-UHFFFAOYSA-N
Data: 1 IC50
Activity Spreadsheet -- Enzyme Inhibition Constant Data from BindingDB
Found 1 hit for monomerid = 50132234
Trg + Lig
Ki
nM
ΔG°
kcal/mole
IC50
nM
Kd
nM
EC50/IC50
nM
koff
s-1
kon
M-1s-1
pHTemp
°C
Platelet-derived growth factor receptor beta
(Homo sapiens (Human))
BDBM50132234
(CHEMBL103599 | N-[4-(4-Benzylthiocarbamoyl-piperaz...)
Show SMILES CC(=O)Nc1cc2c(ncnc2cc1Cl)N1CCN(CC1)C(=S)NCc1ccccc1
Show InChI InChI=1S/C22H23ClN6OS/c1-15(30)27-20-11-17-19(12-18(20)23)25-14-26-21(17)28-7-9-29(10-8-28)22(31)24-13-16-5-3-2-4-6-16/h2-6,11-12,14H,7-10,13H2,1H3,(H,24,31)(H,27,30)
NCI pathway
Reactome pathway
n/an/a>1n/an/an/an/an/an/a
Kyowa Hakko Kogyo Co., Ltd.
Curated by ChEMBL
Assay Description
Inhibitory concentration against platelet-derived growth factor receptor beta phosphorylation in CHO cells
Bioorg Med Chem Lett 13: 3001-4 (2003)
BindingDB Entry DOI: 10.7270/Q2668CKR