BDBM50132394 2-Cyclopentyloxy-6,7-dimethoxy-quinoxaline::CHEMBL319435
SMILES: COc1cc2ncc(OC3CCCC3)nc2cc1OC
InChI Key: InChIKey=CSLYLUOENYVUID-UHFFFAOYSA-N
Data: 1 IC50
Activity Spreadsheet -- Enzyme Inhibition Constant Data from BindingDB
Found 1 hit for monomerid = 50132394
Trg + Lig
Ki
nM
ΔG°
kcal/mole
IC50
nM
Kd
nM
EC50/IC50
nM
koff
s-1
kon
M-1s-1
pHTemp
°C
PDGFR-beta/Platelet-derived growth factor receptor alpha
(Homo sapiens (Human))
BDBM50132394
(2-Cyclopentyloxy-6,7-dimethoxy-quinoxaline | CHEMB...)
Show SMILES COc1cc2ncc(OC3CCCC3)nc2cc1OC
Show InChI InChI=1S/C15H18N2O3/c1-18-13-7-11-12(8-14(13)19-2)17-15(9-16-11)20-10-5-3-4-6-10/h7-10H,3-6H2,1-2H3
Reactome pathway
n/an/a 159n/an/an/an/an/an/a
Aventis Pharmaceuticals
Curated by ChEMBL
Assay Description
Inhibition of Platelet-derived growth factor receptor
Bioorg Med Chem Lett 13: 3091-5 (2003)
BindingDB Entry DOI: 10.7270/Q2N8796B