BDBM50132422 5-(Pyridine-3-carbonyl)-3-[1-(1H-pyrrol-2-yl)-meth-(Z)-ylidene]-1,3-dihydro-indol-2-one::CHEMBL106944
SMILES: O=C(c1cccnc1)c1ccc2NC(=O)\C(=C/c3ccc[nH]3)c2c1
InChI Key: InChIKey=SPELPSFWHJLDOQ-YBEGLDIGSA-N
Data: 1 IC50
Activity Spreadsheet -- Enzyme Inhibition Constant Data from BindingDB
Found 1 hit for monomerid = 50132422
Trg + Lig
Ki
nM
ΔG°
kcal/mole
IC50
nM
Kd
nM
EC50/IC50
nM
koff
s-1
kon
M-1s-1
pHTemp
°C
Tyrosine-protein kinase JAK3
(Homo sapiens (Human))
BDBM50132422
(5-(Pyridine-3-carbonyl)-3-[1-(1H-pyrrol-2-yl)-meth...)
Show SMILES O=C(c1cccnc1)c1ccc2NC(=O)\C(=C/c3ccc[nH]3)c2c1
Show InChI InChI=1S/C19H13N3O2/c23-18(13-3-1-7-20-11-13)12-5-6-17-15(9-12)16(19(24)22-17)10-14-4-2-8-21-14/h1-11,21H,(H,22,24)/b16-10-
Reactome pathway
n/an/a 168n/an/an/an/an/an/a
Aventis Pharmaceuticals
Curated by ChEMBL
Assay Description
Inhibitory activity against Janus Kinase 3 protein tyrosine kinase.
Bioorg Med Chem Lett 13: 3105-10 (2003)
BindingDB Entry DOI: 10.7270/Q2833RDR