BDBM50132428 5-(Hydroxy-thiophen-2-yl-methyl)-3-[1-(1H-pyrrol-2-yl)-meth-(Z)-ylidene]-1,3-dihydro-indol-2-one::CHEMBL107166
SMILES: OC(c1cccs1)c1ccc2NC(=O)\C(=C/c3ccc[nH]3)c2c1
InChI Key: InChIKey=DFKYHHCMFRBWRU-UVTDQMKNSA-N
Data: 1 IC50
Activity Spreadsheet -- Enzyme Inhibition Constant Data from BindingDB
Found 1 hit for monomerid = 50132428
Trg + Lig
Ki
nM
ΔG°
kcal/mole
IC50
nM
Kd
nM
EC50/IC50
nM
koff
s-1
kon
M-1s-1
pHTemp
°C
Tyrosine-protein kinase JAK3
(Homo sapiens (Human))
BDBM50132428
(5-(Hydroxy-thiophen-2-yl-methyl)-3-[1-(1H-pyrrol-2...)
Show SMILES OC(c1cccs1)c1ccc2NC(=O)\C(=C/c3ccc[nH]3)c2c1
Show InChI InChI=1S/C18H14N2O2S/c21-17(16-4-2-8-23-16)11-5-6-15-13(9-11)14(18(22)20-15)10-12-3-1-7-19-12/h1-10,17,19,21H,(H,20,22)/b14-10-
Reactome pathway
n/an/a 190n/an/an/an/an/an/a
Aventis Pharmaceuticals
Curated by ChEMBL
Assay Description
Inhibitory activity against Janus Kinase 3 protein tyrosine kinase.
Bioorg Med Chem Lett 13: 3105-10 (2003)
BindingDB Entry DOI: 10.7270/Q2833RDR