BDBM50132636 (2R,3S)-4-Acetyl-1-[4-(3,5-difluoro-benzyloxy)-benzenesulfonyl]-3-methyl-piperazine-2-carboxylic acid hydroxyamide::CHEMBL111862
SMILES: C[C@H]1[C@@H](N(CCN1C(C)=O)S(=O)(=O)c1ccc(OCc2cc(F)cc(F)c2)cc1)C(=O)NO
InChI Key: InChIKey=RCOBSDNFRJAUBV-RNODOKPDSA-N
Data: 4 IC50
Activity Spreadsheet -- Enzyme Inhibition Constant Data from BindingDB
Found 4 hits for monomerid = 50132636
Trg + Lig
Ki
nM
ΔG°
kcal/mole
IC50
nM
Kd
nM
EC50/IC50
nM
koff
s-1
kon
M-1s-1
pHTemp
°C
Interstitial collagenase
(Homo sapiens (Human))
BDBM50132636
((2R,3S)-4-Acetyl-1-[4-(3,5-difluoro-benzyloxy)-ben...)
Show SMILES C[C@H]1[C@@H](N(CCN1C(C)=O)S(=O)(=O)c1ccc(OCc2cc(F)cc(F)c2)cc1)C(=O)NO
Show InChI InChI=1S/C21H23F2N3O6S/c1-13-20(21(28)24-29)26(8-7-25(13)14(2)27)33(30,31)19-5-3-18(4-6-19)32-12-15-9-16(22)11-17(23)10-15/h3-6,9-11,13,20,29H,7-8,12H2,1-2H3,(H,24,28)/t13-,20+/m0/s1
Reactome pathway
n/an/a 3.80E+3n/an/an/an/an/an/a
Pfizer Global Research and Development
Curated by ChEMBL
Assay Description
In vitro inhibition of matrix metalloprotease-1.
Bioorg Med Chem Lett 13: 3243-6 (2003)
BindingDB Entry DOI: 10.7270/Q2Q23ZMM
Disintegrin and metalloproteinase domain-containing protein 17
(Homo sapiens (Human))
BDBM50132636
((2R,3S)-4-Acetyl-1-[4-(3,5-difluoro-benzyloxy)-ben...)
Show SMILES C[C@H]1[C@@H](N(CCN1C(C)=O)S(=O)(=O)c1ccc(OCc2cc(F)cc(F)c2)cc1)C(=O)NO
Show InChI InChI=1S/C21H23F2N3O6S/c1-13-20(21(28)24-29)26(8-7-25(13)14(2)27)33(30,31)19-5-3-18(4-6-19)32-12-15-9-16(22)11-17(23)10-15/h3-6,9-11,13,20,29H,7-8,12H2,1-2H3,(H,24,28)/t13-,20+/m0/s1
Reactome pathway
n/an/a 1.00E+3n/an/an/an/an/an/a
Pfizer Global Research and Development
Curated by ChEMBL
Assay Description
Inhibition of human recombinant tumor necrosis factor-alpha converting enzyme.
Bioorg Med Chem Lett 13: 3243-6 (2003)
BindingDB Entry DOI: 10.7270/Q2Q23ZMM
Disintegrin and metalloproteinase domain-containing protein 17
(Homo sapiens (Human))
BDBM50132636
((2R,3S)-4-Acetyl-1-[4-(3,5-difluoro-benzyloxy)-ben...)
Show SMILES C[C@H]1[C@@H](N(CCN1C(C)=O)S(=O)(=O)c1ccc(OCc2cc(F)cc(F)c2)cc1)C(=O)NO
Show InChI InChI=1S/C21H23F2N3O6S/c1-13-20(21(28)24-29)26(8-7-25(13)14(2)27)33(30,31)19-5-3-18(4-6-19)32-12-15-9-16(22)11-17(23)10-15/h3-6,9-11,13,20,29H,7-8,12H2,1-2H3,(H,24,28)/t13-,20+/m0/s1
Reactome pathway
n/an/a 6n/an/an/an/an/an/a
Pfizer Global Research and Development
Curated by ChEMBL
Assay Description
Inhibition of human recombinant tumor necrosis factor-alpha converting enzyme.
Bioorg Med Chem Lett 13: 3243-6 (2003)
BindingDB Entry DOI: 10.7270/Q2Q23ZMM
Collagenase 3
(Homo sapiens (Human))
BDBM50132636
((2R,3S)-4-Acetyl-1-[4-(3,5-difluoro-benzyloxy)-ben...)
Show SMILES C[C@H]1[C@@H](N(CCN1C(C)=O)S(=O)(=O)c1ccc(OCc2cc(F)cc(F)c2)cc1)C(=O)NO
Show InChI InChI=1S/C21H23F2N3O6S/c1-13-20(21(28)24-29)26(8-7-25(13)14(2)27)33(30,31)19-5-3-18(4-6-19)32-12-15-9-16(22)11-17(23)10-15/h3-6,9-11,13,20,29H,7-8,12H2,1-2H3,(H,24,28)/t13-,20+/m0/s1
NCI pathway
Reactome pathway
n/an/a 20n/an/an/an/an/an/a
Pfizer Global Research and Development
Curated by ChEMBL
Assay Description
In vitro inhibition of matrix metalloprotease-13.
Bioorg Med Chem Lett 13: 3243-6 (2003)
BindingDB Entry DOI: 10.7270/Q2Q23ZMM