BDBM50132676 2-[3-Butyl-3H-benzothiazol-(2Z)-ylidene]-N-hydroxy-acetamide::CHEMBL324693
SMILES: CCCCN1\C(Sc2ccccc12)=C\C(=O)NO
InChI Key: InChIKey=AFUFDGDPFRCXGP-LCYFTJDESA-N
Data: 1 IC50
Activity Spreadsheet -- Enzyme Inhibition Constant Data from BindingDB
Found 1 hit for monomerid = 50132676
Trg + Lig
Ki
nM
ΔG°
kcal/mole
IC50
nM
Kd
nM
EC50/IC50
nM
koff
s-1
kon
M-1s-1
pHTemp
°C
Peptide deformylase mitochondrial
(Homo sapiens (Human))
BDBM50132676
(2-[3-Butyl-3H-benzothiazol-(2Z)-ylidene]-N-hydroxy...)
Show SMILES CCCCN1\C(Sc2ccccc12)=C\C(=O)NO
Show InChI InChI=1S/C13H16N2O2S/c1-2-3-8-15-10-6-4-5-7-11(10)18-13(15)9-12(16)14-17/h4-7,9,17H,2-3,8H2,1H3,(H,14,16)/b13-9-
n/an/a 1.04E+3n/an/an/an/an/an/a
Senju Pharmaceutical Co., Ltd.
Curated by ChEMBL
Assay Description
In vitro inhibitory concentration required against peptide deformylase (PDF)
Bioorg Med Chem Lett 13: 3273-6 (2003)
BindingDB Entry DOI: 10.7270/Q2FN15MQ