null
SMILES: Cc1ccoc1C(=O)Nc1ccc(nc1)N1C(=O)c2cccc(C)c2C1=O
InChI Key: InChIKey=GLKLCGNIPXPPEJ-UHFFFAOYSA-N
Activity Spreadsheet -- Enzyme Inhibition Constant Data from BindingDB
Found 3 hits for monomerid = 50132808
Trg + Lig
Ki
nM
ΔG°
kcal/mole
IC50
nM
Kd
nM
EC50/IC50
nM
koff
s-1
kon
M-1s-1
pHTemp
°C
Metabotropic glutamate receptor 1
(Homo sapiens (Human))
BDBM50132808
(CHEMBL3634434)
Show SMILES Cc1ccoc1C(=O)Nc1ccc(nc1)N1C(=O)c2cccc(C)c2C1=O
Show InChI InChI=1S/C20H15N3O4/c1-11-4-3-5-14-16(11)20(26)23(19(14)25)15-7-6-13(10-21-15)22-18(24)17-12(2)8-9-27-17/h3-10H,1-2H3,(H,22,24)
n/an/an/an/a 95n/an/an/an/a
Vanderbilt University Medical Center
Curated by ChEMBL
Assay Description
Positive allosteric modulation of human mGluR1 by calcium mobilization assay
Bioorg Med Chem Lett 25: 5107-10 (2015)
BindingDB Entry DOI: 10.7270/Q20C4XKQ
Metabotropic glutamate receptor 4
(Homo sapiens (Human))
BDBM50132808
(CHEMBL3634434)
Show SMILES Cc1ccoc1C(=O)Nc1ccc(nc1)N1C(=O)c2cccc(C)c2C1=O
Show InChI InChI=1S/C20H15N3O4/c1-11-4-3-5-14-16(11)20(26)23(19(14)25)15-7-6-13(10-21-15)22-18(24)17-12(2)8-9-27-17/h3-10H,1-2H3,(H,22,24)
n/an/an/an/a 5.00E+3n/an/an/an/a
Vanderbilt University Medical Center
Curated by ChEMBL
Assay Description
Positive allosteric modulation of human mGluR4 by calcium mobilization assay
Bioorg Med Chem Lett 25: 5107-10 (2015)
BindingDB Entry DOI: 10.7270/Q20C4XKQ
Metabotropic glutamate receptor 1
(Homo sapiens (Human))
BDBM50132808
(CHEMBL3634434)
Show SMILES Cc1ccoc1C(=O)Nc1ccc(nc1)N1C(=O)c2cccc(C)c2C1=O
Show InChI InChI=1S/C20H15N3O4/c1-11-4-3-5-14-16(11)20(26)23(19(14)25)15-7-6-13(10-21-15)22-18(24)17-12(2)8-9-27-17/h3-10H,1-2H3,(H,22,24)
n/an/a 95n/an/an/an/an/an/a
Vanderbilt University Medical Center
Curated by ChEMBL
Assay Description
Positive allosteric modulation of human mGluR1 by calcium mobilization assay
Bioorg Med Chem Lett 25: 5107-10 (2015)
BindingDB Entry DOI: 10.7270/Q20C4XKQ