BDBM50132813 CHEMBL3634460
SMILES: FC(F)(F)c1cc(Oc2ccc(COc3ccn4c(cnc4n3)-c3ccncc3)cc2)ccc1Cl
InChI Key: InChIKey=SHMGPQZISKZVLO-UHFFFAOYSA-N
Data: 1 IC50
Activity Spreadsheet -- Enzyme Inhibition Constant Data from BindingDB
Found 1 hit for monomerid = 50132813
Trg + Lig
Ki
nM
ΔG°
kcal/mole
IC50
nM
Kd
nM
EC50/IC50
nM
koff
s-1
kon
M-1s-1
pHTemp
°C
LDL-associated phospholipase A2
(Homo sapiens (Human))
BDBM50132813
(CHEMBL3634460)
Show SMILES FC(F)(F)c1cc(Oc2ccc(COc3ccn4c(cnc4n3)-c3ccncc3)cc2)ccc1Cl
Show InChI InChI=1S/C25H16ClF3N4O2/c26-21-6-5-19(13-20(21)25(27,28)29)35-18-3-1-16(2-4-18)15-34-23-9-12-33-22(14-31-24(33)32-23)17-7-10-30-11-8-17/h1-14H,15H2
NCI pathway
Reactome pathway
n/an/a 16n/an/an/an/an/an/a
Chinese Academy of Sciences
Curated by ChEMBL
Assay Description
Inhibition of recombinant human Lp-PLA2 using 2-thio-PAF substrate after 10 mins
J Med Chem 58: 8529-41 (2015)
BindingDB Entry DOI: 10.7270/Q2VQ34H4