BDBM50132969 CHEMBL431076::[2-Methyl-8-(2,4,6-trimethyl-phenyl)-quinolin-4-yl]-dipropyl-amine
SMILES: CCCN(CCC)c1cc(C)nc2c(cccc12)-c1c(C)cc(C)cc1C
InChI Key: InChIKey=NUDMNTFRWJIIBW-UHFFFAOYSA-N
Data: 1 KI  1 IC50
Activity Spreadsheet -- Enzyme Inhibition Constant Data from BindingDB
Found 2 hits for monomerid = 50132969
Trg + Lig
Ki
nM
ΔG°
kcal/mole
IC50
nM
Kd
nM
EC50/IC50
nM
koff
s-1
kon
M-1s-1
pHTemp
°C
Corticotropin releasing factor receptor 1
(Homo sapiens (Human))
BDBM50132969
(CHEMBL431076 | [2-Methyl-8-(2,4,6-trimethyl-phenyl...)
Show SMILES CCCN(CCC)c1cc(C)nc2c(cccc12)-c1c(C)cc(C)cc1C |(10.69,-3.51,;9.36,-2.74,;9.36,-1.2,;8.01,-.43,;8.01,1.11,;9.34,1.88,;9.34,3.42,;6.68,-1.22,;6.68,-2.75,;5.34,-3.53,;5.34,-5.07,;4.01,-2.76,;4.01,-1.22,;2.68,-.45,;2.68,1.1,;4.01,1.87,;5.35,1.1,;5.35,-.45,;1.35,-1.22,;.01,-.44,;.02,1.1,;-1.32,-1.21,;-1.32,-2.75,;-2.65,-3.52,;.02,-3.52,;1.35,-2.75,;2.69,-3.52,)|
Show InChI InChI=1S/C25H32N2/c1-7-12-27(13-8-2)23-16-20(6)26-25-21(23)10-9-11-22(25)24-18(4)14-17(3)15-19(24)5/h9-11,14-16H,7-8,12-13H2,1-6H3
Reactome pathway
3n/an/an/an/an/an/an/an/a
Neurocrine Biosciences, Inc.
Curated by ChEMBL
Assay Description
Inhibition of Corticotropin releasing factor receptor 1-stimulated cAMP production
Bioorg Med Chem Lett 13: 3375-9 (2003)
BindingDB Entry DOI: 10.7270/Q2WM1CS4
Corticotropin releasing factor receptor 1
(Homo sapiens (Human))
BDBM50132969
(CHEMBL431076 | [2-Methyl-8-(2,4,6-trimethyl-phenyl...)
Show SMILES CCCN(CCC)c1cc(C)nc2c(cccc12)-c1c(C)cc(C)cc1C |(10.69,-3.51,;9.36,-2.74,;9.36,-1.2,;8.01,-.43,;8.01,1.11,;9.34,1.88,;9.34,3.42,;6.68,-1.22,;6.68,-2.75,;5.34,-3.53,;5.34,-5.07,;4.01,-2.76,;4.01,-1.22,;2.68,-.45,;2.68,1.1,;4.01,1.87,;5.35,1.1,;5.35,-.45,;1.35,-1.22,;.01,-.44,;.02,1.1,;-1.32,-1.21,;-1.32,-2.75,;-2.65,-3.52,;.02,-3.52,;1.35,-2.75,;2.69,-3.52,)|
Show InChI InChI=1S/C25H32N2/c1-7-12-27(13-8-2)23-16-20(6)26-25-21(23)10-9-11-22(25)24-18(4)14-17(3)15-19(24)5/h9-11,14-16H,7-8,12-13H2,1-6H3
Reactome pathway
n/an/a 14n/an/an/an/an/an/a
Neurocrine Biosciences, Inc.
Curated by ChEMBL
Assay Description
Inhibition of Corticotropin releasing factor receptor 1-stimulated cAMP production
Bioorg Med Chem Lett 13: 3375-9 (2003)
BindingDB Entry DOI: 10.7270/Q2WM1CS4