null
SMILES: c1[nH]nc(c1-c1ccnc2ccccc12)-c1ccccc1
InChI Key: InChIKey=ZNEAEMOGRAJFJZ-UHFFFAOYSA-N
Activity Spreadsheet -- Enzyme Inhibition Constant Data from BindingDB
Found 5 hits for monomerid = 50132993
Trg + Lig
Ki
nM
ΔG°
kcal/mole
IC50
nM
Kd
nM
EC50/IC50
nM
koff
s-1
kon
M-1s-1
pHTemp
°C
TGF-beta receptor type-1
(Homo sapiens (Human))
BDBM50132993
(4-(3-Phenyl-1H-pyrazol-4-yl)-quinoline | 4-(3-phen...)
Show SMILES c1[nH]nc(c1-c1ccnc2ccccc12)-c1ccccc1
Show InChI InChI=1S/C18H13N3/c1-2-6-13(7-3-1)18-16(12-20-21-18)14-10-11-19-17-9-5-4-8-15(14)17/h1-12H,(H,20,21)
n/an/a 25n/an/an/an/an/an/a
The Lilly Research Laboratories
Curated by ChEMBL
Assay Description
In vitro inhibitory activity against Mitogen-activated protein kinase p38
J Med Chem 46: 3953-6 (2003)
Article DOI: 10.1021/jm0205705
BindingDB Entry DOI: 10.7270/Q2RV0N38
TGF-beta receptor type-1
(Homo sapiens (Human))
BDBM50132993
(4-(3-Phenyl-1H-pyrazol-4-yl)-quinoline | 4-(3-phen...)
Show SMILES c1[nH]nc(c1-c1ccnc2ccccc12)-c1ccccc1
Show InChI InChI=1S/C18H13N3/c1-2-6-13(7-3-1)18-16(12-20-21-18)14-10-11-19-17-9-5-4-8-15(14)17/h1-12H,(H,20,21)
n/an/a 382n/an/an/an/an/an/a
The Lilly Research Laboratories
Curated by ChEMBL
Assay Description
In vitro inhibitory activity against human Transforming growth factor beta-1 receptor kinase (TGF-beta RIK)
J Med Chem 46: 3953-6 (2003)
Article DOI: 10.1021/jm0205705
BindingDB Entry DOI: 10.7270/Q2RV0N38
TGF-beta receptor type-1
(Homo sapiens (Human))
BDBM50132993
(4-(3-Phenyl-1H-pyrazol-4-yl)-quinoline | 4-(3-phen...)
Show SMILES c1[nH]nc(c1-c1ccnc2ccccc12)-c1ccccc1
Show InChI InChI=1S/C18H13N3/c1-2-6-13(7-3-1)18-16(12-20-21-18)14-10-11-19-17-9-5-4-8-15(14)17/h1-12H,(H,20,21)
n/an/a 382n/an/an/an/an/an/a
Sichuan University
Curated by ChEMBL
Assay Description
Inhibition of TGFR1
Eur J Med Chem 44: 4259-65 (2009)
Article DOI: 10.1016/j.ejmech.2009.07.008
BindingDB Entry DOI: 10.7270/Q2BC3ZM9
TGF-beta receptor type-1
(Homo sapiens (Human))
BDBM50132993
(4-(3-Phenyl-1H-pyrazol-4-yl)-quinoline | 4-(3-phen...)
Show SMILES c1[nH]nc(c1-c1ccnc2ccccc12)-c1ccccc1
Show InChI InChI=1S/C18H13N3/c1-2-6-13(7-3-1)18-16(12-20-21-18)14-10-11-19-17-9-5-4-8-15(14)17/h1-12H,(H,20,21)
n/an/a 1.20E+3n/an/an/an/an/an/a
The Lilly Research Laboratories
Curated by ChEMBL
Assay Description
In vitro inhibition of transforming growth factor- beta dependent luciferase production in mink lung cells (p3TP Lux)
J Med Chem 46: 3953-6 (2003)
Article DOI: 10.1021/jm0205705
BindingDB Entry DOI: 10.7270/Q2RV0N38
TGF-beta receptor type-1
(Homo sapiens (Human))
BDBM50132993
(4-(3-Phenyl-1H-pyrazol-4-yl)-quinoline | 4-(3-phen...)
Show SMILES c1[nH]nc(c1-c1ccnc2ccccc12)-c1ccccc1
Show InChI InChI=1S/C18H13N3/c1-2-6-13(7-3-1)18-16(12-20-21-18)14-10-11-19-17-9-5-4-8-15(14)17/h1-12H,(H,20,21)
n/an/a 2.92E+3n/an/an/an/an/an/a
The Lilly Research Laboratories
Curated by ChEMBL
Assay Description
In vitro inhibition of transforming growth factor- beta dependent luciferase growth in mouse fibroblasts (NIH 3T3)
J Med Chem 46: 3953-6 (2003)
Article DOI: 10.1021/jm0205705
BindingDB Entry DOI: 10.7270/Q2RV0N38