BDBM50133114 5-{2-[2-(3-Fluoro-propoxy)-3,5-diisopropyl-phenyl]-cyclopent-1-enyl}-3-methyl-penta-2,4-dienoic acid::CHEMBL336086
SMILES: CC(C)c1cc(C(C)C)c(OCCCF)c(c1)C1=C(CCC1)\C=C\C(\C)=C\C(O)=O
InChI Key: InChIKey=HCXVTFDYDVOCPY-XJZNFUNPSA-N
Data: 8 KI  1 IC50
Activity Spreadsheet -- Enzyme Inhibition Constant Data from BindingDB
Found 9 hits for monomerid = 50133114
Trg + Lig
Ki
nM
ΔG°
kcal/mole
IC50
nM
Kd
nM
EC50/IC50
nM
koff
s-1
kon
M-1s-1
pHTemp
°C
NR2B Channel Blocker
(RAT)
BDBM50133114
(5-{2-[2-(3-Fluoro-propoxy)-3,5-diisopropyl-phenyl]...)
Show SMILES CC(C)c1cc(C(C)C)c(OCCCF)c(c1)C1=C(CCC1)\C=C\C(\C)=C\C(O)=O |t:18|
Show InChI InChI=1S/C26H35FO3/c1-17(2)21-15-23(18(3)4)26(30-13-7-12-27)24(16-21)22-9-6-8-20(22)11-10-19(5)14-25(28)29/h10-11,14-18H,6-9,12-13H2,1-5H3,(H,28,29)/b11-10+,19-14+
1.90n/an/an/an/an/an/an/an/a
Ligand Pharmaceuticals, Inc.
Curated by ChEMBL
Assay Description
Binding affinity for Retinoic acid receptor RXR-alpha was determined by competing with 3[H]-9-cis-RA
J Med Chem 46: 4087-103 (2003)
Article DOI: 10.1021/jm020401k
BindingDB Entry DOI: 10.7270/Q2VM4BNR
Retinoid X receptor beta
(Rattus norvegicus)
BDBM50133114
(5-{2-[2-(3-Fluoro-propoxy)-3,5-diisopropyl-phenyl]...)
Show SMILES CC(C)c1cc(C(C)C)c(OCCCF)c(c1)C1=C(CCC1)\C=C\C(\C)=C\C(O)=O |t:18|
Show InChI InChI=1S/C26H35FO3/c1-17(2)21-15-23(18(3)4)26(30-13-7-12-27)24(16-21)22-9-6-8-20(22)11-10-19(5)14-25(28)29/h10-11,14-18H,6-9,12-13H2,1-5H3,(H,28,29)/b11-10+,19-14+
5.70n/an/an/an/an/an/an/an/a
Ligand Pharmaceuticals, Inc.
Curated by ChEMBL
Assay Description
Binding affinity for Retinoic acid receptor RXR-beta was determined by competing with 3[H]-9-cis-RA
J Med Chem 46: 4087-103 (2003)
Article DOI: 10.1021/jm020401k
BindingDB Entry DOI: 10.7270/Q2VM4BNR
Retinoid X receptor gamma
(Rattus norvegicus)
BDBM50133114
(5-{2-[2-(3-Fluoro-propoxy)-3,5-diisopropyl-phenyl]...)
Show SMILES CC(C)c1cc(C(C)C)c(OCCCF)c(c1)C1=C(CCC1)\C=C\C(\C)=C\C(O)=O |t:18|
Show InChI InChI=1S/C26H35FO3/c1-17(2)21-15-23(18(3)4)26(30-13-7-12-27)24(16-21)22-9-6-8-20(22)11-10-19(5)14-25(28)29/h10-11,14-18H,6-9,12-13H2,1-5H3,(H,28,29)/b11-10+,19-14+
Reactome pathway
7.60n/an/an/an/an/an/an/an/a
Ligand Pharmaceuticals, Inc.
Curated by ChEMBL
Assay Description
Binding affinity for Retinoic acid receptor RXR-gamma was determined by competing with 3[H]-9-cis-RA
J Med Chem 46: 4087-103 (2003)
Article DOI: 10.1021/jm020401k
BindingDB Entry DOI: 10.7270/Q2VM4BNR
Retinoic acid receptor gamma
(Rattus norvegicus)
BDBM50133114
(5-{2-[2-(3-Fluoro-propoxy)-3,5-diisopropyl-phenyl]...)
Show SMILES CC(C)c1cc(C(C)C)c(OCCCF)c(c1)C1=C(CCC1)\C=C\C(\C)=C\C(O)=O |t:18|
Show InChI InChI=1S/C26H35FO3/c1-17(2)21-15-23(18(3)4)26(30-13-7-12-27)24(16-21)22-9-6-8-20(22)11-10-19(5)14-25(28)29/h10-11,14-18H,6-9,12-13H2,1-5H3,(H,28,29)/b11-10+,19-14+
Reactome pathway
2.22E+3n/an/an/an/an/an/an/an/a
Ligand Pharmaceuticals, Inc.
Curated by ChEMBL
Assay Description
Binding affinity for Retinoic acid receptor gamma was determined by competing with 3[H]-ATRA
J Med Chem 46: 4087-103 (2003)
Article DOI: 10.1021/jm020401k
BindingDB Entry DOI: 10.7270/Q2VM4BNR
Retinoic acid receptor alpha
(Rattus norvegicus)
BDBM50133114
(5-{2-[2-(3-Fluoro-propoxy)-3,5-diisopropyl-phenyl]...)
Show SMILES CC(C)c1cc(C(C)C)c(OCCCF)c(c1)C1=C(CCC1)\C=C\C(\C)=C\C(O)=O |t:18|
Show InChI InChI=1S/C26H35FO3/c1-17(2)21-15-23(18(3)4)26(30-13-7-12-27)24(16-21)22-9-6-8-20(22)11-10-19(5)14-25(28)29/h10-11,14-18H,6-9,12-13H2,1-5H3,(H,28,29)/b11-10+,19-14+
Reactome pathway
2.48E+3n/an/an/an/an/an/an/an/a
Ligand Pharmaceuticals, Inc.
Curated by ChEMBL
Assay Description
Binding affinity for Retinoic acid receptor alpha was determined by competing with 3[H]-ATRA
J Med Chem 46: 4087-103 (2003)
Article DOI: 10.1021/jm020401k
BindingDB Entry DOI: 10.7270/Q2VM4BNR
Peroxisome proliferator-activated receptor gamma
(Rattus norvegicus)
BDBM50133114
(5-{2-[2-(3-Fluoro-propoxy)-3,5-diisopropyl-phenyl]...)
Show SMILES CC(C)c1cc(C(C)C)c(OCCCF)c(c1)C1=C(CCC1)\C=C\C(\C)=C\C(O)=O |t:18|
Show InChI InChI=1S/C26H35FO3/c1-17(2)21-15-23(18(3)4)26(30-13-7-12-27)24(16-21)22-9-6-8-20(22)11-10-19(5)14-25(28)29/h10-11,14-18H,6-9,12-13H2,1-5H3,(H,28,29)/b11-10+,19-14+
Reactome pathway
4.71E+3n/an/an/an/an/an/an/an/a
Ligand Pharmaceuticals, Inc.
Curated by ChEMBL
Assay Description
Binding affinity for Peroxisome proliferator activated receptor gamma was determined
J Med Chem 46: 4087-103 (2003)
Article DOI: 10.1021/jm020401k
BindingDB Entry DOI: 10.7270/Q2VM4BNR
Retinoid receptor
(Homo sapiens (Human))
BDBM50133114
(5-{2-[2-(3-Fluoro-propoxy)-3,5-diisopropyl-phenyl]...)
Show SMILES CC(C)c1cc(C(C)C)c(OCCCF)c(c1)C1=C(CCC1)\C=C\C(\C)=C\C(O)=O |t:18|
Show InChI InChI=1S/C26H35FO3/c1-17(2)21-15-23(18(3)4)26(30-13-7-12-27)24(16-21)22-9-6-8-20(22)11-10-19(5)14-25(28)29/h10-11,14-18H,6-9,12-13H2,1-5H3,(H,28,29)/b11-10+,19-14+
Reactome pathway
8.27E+3n/an/an/an/an/an/an/an/a
Ligand Pharmaceuticals, Inc.
Curated by ChEMBL
Assay Description
Binding affinity for Retinoic acid receptor beta was determined by competing with 3[H]-ATRA
J Med Chem 46: 4087-103 (2003)
Article DOI: 10.1021/jm020401k
BindingDB Entry DOI: 10.7270/Q2VM4BNR
Peroxisome proliferator-activated receptor alpha
(Rattus norvegicus)
BDBM50133114
(5-{2-[2-(3-Fluoro-propoxy)-3,5-diisopropyl-phenyl]...)
Show SMILES CC(C)c1cc(C(C)C)c(OCCCF)c(c1)C1=C(CCC1)\C=C\C(\C)=C\C(O)=O |t:18|
Show InChI InChI=1S/C26H35FO3/c1-17(2)21-15-23(18(3)4)26(30-13-7-12-27)24(16-21)22-9-6-8-20(22)11-10-19(5)14-25(28)29/h10-11,14-18H,6-9,12-13H2,1-5H3,(H,28,29)/b11-10+,19-14+
Reactome pathway
>1.00E+4n/an/an/an/an/an/an/an/a
Ligand Pharmaceuticals, Inc.
Curated by ChEMBL
Assay Description
Binding affinity for peroxisome Peroxisome proliferator activated receptor alpha was determined
J Med Chem 46: 4087-103 (2003)
Article DOI: 10.1021/jm020401k
BindingDB Entry DOI: 10.7270/Q2VM4BNR
Retinoid X receptor alpha
(RAT)
BDBM50133114
(5-{2-[2-(3-Fluoro-propoxy)-3,5-diisopropyl-phenyl]...)
Show SMILES CC(C)c1cc(C(C)C)c(OCCCF)c(c1)C1=C(CCC1)\C=C\C(\C)=C\C(O)=O |t:18|
Show InChI InChI=1S/C26H35FO3/c1-17(2)21-15-23(18(3)4)26(30-13-7-12-27)24(16-21)22-9-6-8-20(22)11-10-19(5)14-25(28)29/h10-11,14-18H,6-9,12-13H2,1-5H3,(H,28,29)/b11-10+,19-14+
n/an/a 3.30n/an/an/an/an/an/a
Ligand Pharmaceuticals, Inc.
Curated by ChEMBL
Assay Description
Binding affinity for Retinoic acid receptor RXR-alpha was determined by competing with 3[H]-9-cis-RA
J Med Chem 46: 4087-103 (2003)
Article DOI: 10.1021/jm020401k
BindingDB Entry DOI: 10.7270/Q2VM4BNR