BDBM50133146 7-Fluoro-2,2,4-trimethyl-5-[1-phenyl-meth-(Z)-ylidene]-2,5-dihydro-1H-6-oxa-1-aza-chrysene::CHEMBL413309
SMILES: CC1=CC(C)(C)Nc2ccc3-c4cccc(F)c4O\C(=C/c4ccccc4)c3c12
InChI Key: InChIKey=RTLRJRHSVSOAFD-HMAPJEAMSA-N
Data: 3 KI  2 IC50  2 EC50
Activity Spreadsheet -- Enzyme Inhibition Constant Data from BindingDB
Found 7 hits for monomerid = 50133146
Trg + Lig
Ki
nM
ΔG°
kcal/mole
IC50
nM
Kd
nM
EC50/IC50
nM
koff
s-1
kon
M-1s-1
pHTemp
°C
Progesterone receptor
(Homo sapiens (Human))
BDBM50133146
(7-Fluoro-2,2,4-trimethyl-5-[1-phenyl-meth-(Z)-ylid...)
Show SMILES CC1=CC(C)(C)Nc2ccc3-c4cccc(F)c4O\C(=C/c4ccccc4)c3c12 |t:1|
Show InChI InChI=1S/C26H22FNO/c1-16-15-26(2,3)28-21-13-12-18-19-10-7-11-20(27)25(19)29-22(24(18)23(16)21)14-17-8-5-4-6-9-17/h4-15,28H,1-3H3/b22-14-
0.610n/an/an/an/an/an/an/an/a
Ligand Pharmaceuticals Inc.
Curated by ChEMBL
Assay Description
Binding affinity towards human progesterone receptor A isoform using progesterone as radioligand
J Med Chem 46: 4104-12 (2003)
Article DOI: 10.1021/jm020477g
BindingDB Entry DOI: 10.7270/Q2QZ29C6
Glucocorticoid receptor
(Homo sapiens (Human))
BDBM50133146
(7-Fluoro-2,2,4-trimethyl-5-[1-phenyl-meth-(Z)-ylid...)
Show SMILES CC1=CC(C)(C)Nc2ccc3-c4cccc(F)c4O\C(=C/c4ccccc4)c3c12 |t:1|
Show InChI InChI=1S/C26H22FNO/c1-16-15-26(2,3)28-21-13-12-18-19-10-7-11-20(27)25(19)29-22(24(18)23(16)21)14-17-8-5-4-6-9-17/h4-15,28H,1-3H3/b22-14-
321n/an/an/an/an/an/an/an/a
Ligand Pharmaceuticals Inc.
Curated by ChEMBL
Assay Description
Inhibition of Dexamethasone binding to human glucocorticoid receptor expressed in baculovirus SF-12 cells
J Med Chem 46: 4104-12 (2003)
Article DOI: 10.1021/jm020477g
BindingDB Entry DOI: 10.7270/Q2QZ29C6
Androgen Receptor
(Homo sapiens (Human))
BDBM50133146
(7-Fluoro-2,2,4-trimethyl-5-[1-phenyl-meth-(Z)-ylid...)
Show SMILES CC1=CC(C)(C)Nc2ccc3-c4cccc(F)c4O\C(=C/c4ccccc4)c3c12 |t:1|
Show InChI InChI=1S/C26H22FNO/c1-16-15-26(2,3)28-21-13-12-18-19-10-7-11-20(27)25(19)29-22(24(18)23(16)21)14-17-8-5-4-6-9-17/h4-15,28H,1-3H3/b22-14-
NCI pathway
Reactome pathway
1.46E+3n/an/an/an/an/an/an/an/a
Ligand Pharmaceuticals Inc.
Curated by ChEMBL
Assay Description
Inhibition of DHT binding to human androgen receptor expressed in baculovirus SF-12 cells
J Med Chem 46: 4104-12 (2003)
Article DOI: 10.1021/jm020477g
BindingDB Entry DOI: 10.7270/Q2QZ29C6
Glucocorticoid receptor
(Homo sapiens (Human))
BDBM50133146
(7-Fluoro-2,2,4-trimethyl-5-[1-phenyl-meth-(Z)-ylid...)
Show SMILES CC1=CC(C)(C)Nc2ccc3-c4cccc(F)c4O\C(=C/c4ccccc4)c3c12 |t:1|
Show InChI InChI=1S/C26H22FNO/c1-16-15-26(2,3)28-21-13-12-18-19-10-7-11-20(27)25(19)29-22(24(18)23(16)21)14-17-8-5-4-6-9-17/h4-15,28H,1-3H3/b22-14-
n/an/a 250n/an/an/an/an/an/a
Ligand Pharmaceuticals Inc.
Curated by ChEMBL
Assay Description
Inhibition of human glucocorticoid receptor at 10e-12 to 10e-5 M
J Med Chem 46: 4104-12 (2003)
Article DOI: 10.1021/jm020477g
BindingDB Entry DOI: 10.7270/Q2QZ29C6
Progesterone receptor
(Homo sapiens (Human))
BDBM50133146
(7-Fluoro-2,2,4-trimethyl-5-[1-phenyl-meth-(Z)-ylid...)
Show SMILES CC1=CC(C)(C)Nc2ccc3-c4cccc(F)c4O\C(=C/c4ccccc4)c3c12 |t:1|
Show InChI InChI=1S/C26H22FNO/c1-16-15-26(2,3)28-21-13-12-18-19-10-7-11-20(27)25(19)29-22(24(18)23(16)21)14-17-8-5-4-6-9-17/h4-15,28H,1-3H3/b22-14-
n/an/an/an/a 2.10n/an/an/an/a
Ligand Pharmaceuticals Inc.
Curated by ChEMBL
Assay Description
Agonistic activity against human progesterone receptor in CV-1 cells
J Med Chem 46: 4104-12 (2003)
Article DOI: 10.1021/jm020477g
BindingDB Entry DOI: 10.7270/Q2QZ29C6
Progesterone receptor
(Homo sapiens (Human))
BDBM50133146
(7-Fluoro-2,2,4-trimethyl-5-[1-phenyl-meth-(Z)-ylid...)
Show SMILES CC1=CC(C)(C)Nc2ccc3-c4cccc(F)c4O\C(=C/c4ccccc4)c3c12 |t:1|
Show InChI InChI=1S/C26H22FNO/c1-16-15-26(2,3)28-21-13-12-18-19-10-7-11-20(27)25(19)29-22(24(18)23(16)21)14-17-8-5-4-6-9-17/h4-15,28H,1-3H3/b22-14-
n/an/an/an/a 11n/an/an/an/a
Ligand Pharmaceuticals Inc.
Curated by ChEMBL
Assay Description
Agonistic activity against human progesterone receptor in T47D breast cancer cells
J Med Chem 46: 4104-12 (2003)
Article DOI: 10.1021/jm020477g
BindingDB Entry DOI: 10.7270/Q2QZ29C6
Androgen Receptor
(Homo sapiens (Human))
BDBM50133146
(7-Fluoro-2,2,4-trimethyl-5-[1-phenyl-meth-(Z)-ylid...)
Show SMILES CC1=CC(C)(C)Nc2ccc3-c4cccc(F)c4O\C(=C/c4ccccc4)c3c12 |t:1|
Show InChI InChI=1S/C26H22FNO/c1-16-15-26(2,3)28-21-13-12-18-19-10-7-11-20(27)25(19)29-22(24(18)23(16)21)14-17-8-5-4-6-9-17/h4-15,28H,1-3H3/b22-14-
NCI pathway
Reactome pathway
n/an/a 900n/an/an/an/an/an/a
Ligand Pharmaceuticals Inc.
Curated by ChEMBL
Assay Description
Inihibition of human androgen receptor at 10e-12 to 10e-5 M
J Med Chem 46: 4104-12 (2003)
Article DOI: 10.1021/jm020477g
BindingDB Entry DOI: 10.7270/Q2QZ29C6