null
SMILES: CC1(C)CCC2=C(O1)c1ccc(F)cc1C(=O)C2=O
InChI Key: InChIKey=NLISVJXCSAFEBY-UHFFFAOYSA-N
Activity Spreadsheet -- Enzyme Inhibition Constant Data from BindingDB
Found 1 hit for monomerid = 50133331
Trg + Lig
Ki
nM
ΔG°
kcal/mole
IC50
nM
Kd
nM
EC50/IC50
nM
koff
s-1
kon
M-1s-1
pHTemp
°C
Mucosa-associated lymphoid tissue lymphoma translocation protein 1
(Homo sapiens (Human))
BDBM50133331
(CHEMBL3632804)
Show SMILES CC1(C)CCC2=C(O1)c1ccc(F)cc1C(=O)C2=O |c:5|
Show InChI InChI=1S/C15H13FO3/c1-15(2)6-5-10-12(17)13(18)11-7-8(16)3-4-9(11)14(10)19-15/h3-4,7H,5-6H2,1-2H3
n/an/a 1.50E+3n/an/an/an/an/an/a
Institute of Basic Science (IBS)
Curated by ChEMBL
Assay Description
Inhibition of His-tagged human MALT1 (catalytic domain-339-719 aa) by fluorescence based assay using 25 uM Ac-LRSR-AMC as substrate
J Med Chem 58: 8491-502 (2015)
BindingDB Entry DOI: 10.7270/Q2PZ5BN1