null
SMILES: CCCOc1ccc(NC(=O)N2CCC[C@H]2C(=O)N2CC[C@H]3[C@H]2[C@H](C)C(=O)N3C(=O)C2CC2)cc1
InChI Key: InChIKey=KGQCGAWCFMTRJG-IRNNPGBSSA-N
Activity Spreadsheet -- Enzyme Inhibition Constant Data from BindingDB
Found 2 hits for monomerid = 50133981
Trg + Lig
Ki
nM
ΔG°
kcal/mole
IC50
nM
Kd
nM
EC50/IC50
nM
koff
s-1
kon
M-1s-1
pHTemp
°C
Capsid scaffolding protein
(Human cytomegalovirus (strain AD169) (HHV-5) (Huma...)
BDBM50133981
((2S)-2-{[(3aS,6S,6aR)-4-(Cyclopropylcarbonyl)-6-me...)
Show SMILES CCCOc1ccc(NC(=O)N2CCC[C@H]2C(=O)N2CC[C@H]3[C@H]2[C@H](C)C(=O)N3C(=O)C2CC2)cc1 |r|
Show InChI InChI=1S/C26H34N4O5/c1-3-15-35-19-10-8-18(9-11-19)27-26(34)28-13-4-5-21(28)25(33)29-14-12-20-22(29)16(2)23(31)30(20)24(32)17-6-7-17/h8-11,16-17,20-22H,3-7,12-15H2,1-2H3,(H,27,34)/t16-,20-,21-,22+/m0/s1
9n/an/an/an/an/an/an/an/a
GlaxoSmithKline Research and Development
Curated by ChEMBL
Assay Description
Potency against human cytomegalovirus protease in HCMV pNA assay
J Med Chem 46: 4428-49 (2003)
Article DOI: 10.1021/jm030810w
BindingDB Entry DOI: 10.7270/Q2WH2PD8
Capsid scaffolding protein
(Human cytomegalovirus (strain AD169) (HHV-5) (Huma...)
BDBM50133981
((2S)-2-{[(3aS,6S,6aR)-4-(Cyclopropylcarbonyl)-6-me...)
Show SMILES CCCOc1ccc(NC(=O)N2CCC[C@H]2C(=O)N2CC[C@H]3[C@H]2[C@H](C)C(=O)N3C(=O)C2CC2)cc1 |r|
Show InChI InChI=1S/C26H34N4O5/c1-3-15-35-19-10-8-18(9-11-19)27-26(34)28-13-4-5-21(28)25(33)29-14-12-20-22(29)16(2)23(31)30(20)24(32)17-6-7-17/h8-11,16-17,20-22H,3-7,12-15H2,1-2H3,(H,27,34)/t16-,20-,21-,22+/m0/s1
n/an/a 210n/an/an/an/an/an/a
GlaxoSmithKline Research and Development
Curated by ChEMBL
Assay Description
Inhibition of human cytomegalovirus protease in HCMV pNA assay.
J Med Chem 46: 4428-49 (2003)
Article DOI: 10.1021/jm030810w
BindingDB Entry DOI: 10.7270/Q2WH2PD8