BDBM50133987 (3S,3aR,6aS)-1-Cyclopropanecarbonyl-4-[(S)-1-(4-isopropyl-benzenesulfonyl)-pyrrolidine-2-carbonyl]-3-methyl-hexahydro-pyrrolo[3,2-b]pyrrol-2-one::CHEMBL138754
SMILES: CC(C)c1ccc(cc1)S(=O)(=O)N1CCC[C@H]1C(=O)N1CC[C@H]2[C@H]1[C@H](C)C(=O)N2C(=O)C1CC1
InChI Key: InChIKey=GXMSRBAIJDKESQ-IRNNPGBSSA-N
Data: 1 KI  1 IC50
Activity Spreadsheet -- Enzyme Inhibition Constant Data from BindingDB
Found 2 hits for monomerid = 50133987
Trg + Lig
Ki
nM
ΔG°
kcal/mole
IC50
nM
Kd
nM
EC50/IC50
nM
koff
s-1
kon
M-1s-1
pHTemp
°C
Human herpes virus 5 capsid protein P40
(Human cytomegalovirus (strain AD169) (HHV-5) (Huma...)
BDBM50133987
((3S,3aR,6aS)-1-Cyclopropanecarbonyl-4-[(S)-1-(4-is...)
Show SMILES CC(C)c1ccc(cc1)S(=O)(=O)N1CCC[C@H]1C(=O)N1CC[C@H]2[C@H]1[C@H](C)C(=O)N2C(=O)C1CC1
Show InChI InChI=1S/C25H33N3O5S/c1-15(2)17-8-10-19(11-9-17)34(32,33)27-13-4-5-21(27)25(31)26-14-12-20-22(26)16(3)23(29)28(20)24(30)18-6-7-18/h8-11,15-16,18,20-22H,4-7,12-14H2,1-3H3/t16-,20-,21-,22+/m0/s1
99n/an/an/an/an/an/an/an/a
GlaxoSmithKline Research and Development
Curated by ChEMBL
Assay Description
Potency against human cytomegalovirus protease in HCMV pNA assay
J Med Chem 46: 4428-49 (2003)
Article DOI: 10.1021/jm030810w
BindingDB Entry DOI: 10.7270/Q2WH2PD8
Human herpes virus 5 capsid protein P40
(Human cytomegalovirus (strain AD169) (HHV-5) (Huma...)
BDBM50133987
((3S,3aR,6aS)-1-Cyclopropanecarbonyl-4-[(S)-1-(4-is...)
Show SMILES CC(C)c1ccc(cc1)S(=O)(=O)N1CCC[C@H]1C(=O)N1CC[C@H]2[C@H]1[C@H](C)C(=O)N2C(=O)C1CC1
Show InChI InChI=1S/C25H33N3O5S/c1-15(2)17-8-10-19(11-9-17)34(32,33)27-13-4-5-21(27)25(31)26-14-12-20-22(26)16(3)23(29)28(20)24(30)18-6-7-18/h8-11,15-16,18,20-22H,4-7,12-14H2,1-3H3/t16-,20-,21-,22+/m0/s1
n/an/a 460n/an/an/an/an/an/a
GlaxoSmithKline Research and Development
Curated by ChEMBL
Assay Description
Inhibition of human cytomegalovirus protease in HCMV pNA assay.
J Med Chem 46: 4428-49 (2003)
Article DOI: 10.1021/jm030810w
BindingDB Entry DOI: 10.7270/Q2WH2PD8