BDBM50134128 (5R,6R)-6-Benzo[1,3]dioxol-5-yl-2-isopropyl-2,3,6,7,12,12a-hexahydro-pyrazino[1',2':1,6]pyrido[3,4-b]indole-1,4-dione::CHEMBL434797
SMILES: CC(C)N1CC(=O)N2[C@H](Cc3c([nH]c4ccccc34)[C@H]2c2ccc3OCOc3c2)C1=O
InChI Key: InChIKey=BIVDXKUVGNOBJF-WZONZLPQSA-N
Data: 2 IC50
Activity Spreadsheet -- Enzyme Inhibition Constant Data from BindingDB
Found 2 hits for monomerid = 50134128
Trg + Lig
Ki
nM
ΔG°
kcal/mole
IC50
nM
Kd
nM
EC50/IC50
nM
koff
s-1
kon
M-1s-1
pHTemp
°C
Phosphodiesterase 5A
(Bos taurus)
BDBM50134128
((5R,6R)-6-Benzo[1,3]dioxol-5-yl-2-isopropyl-2,3,6,...)
Show SMILES CC(C)N1CC(=O)N2[C@H](Cc3c([nH]c4ccccc34)[C@H]2c2ccc3OCOc3c2)C1=O
Show InChI InChI=1S/C24H23N3O4/c1-13(2)26-11-21(28)27-18(24(26)29)10-16-15-5-3-4-6-17(15)25-22(16)23(27)14-7-8-19-20(9-14)31-12-30-19/h3-9,13,18,23,25H,10-12H2,1-2H3/t18-,23-/m1/s1
Reactome pathway
n/an/a 8n/an/an/an/an/an/a
Centre de Recherches
Curated by ChEMBL
Assay Description
In vitro inhibitory activity against bovine phosphodiesterase 5
J Med Chem 46: 4533-42 (2003)
Article DOI: 10.1021/jm0300577
BindingDB Entry DOI: 10.7270/Q2N015X2
Phosphodiesterase 5A
(Bos taurus)
BDBM50134128
((5R,6R)-6-Benzo[1,3]dioxol-5-yl-2-isopropyl-2,3,6,...)
Show SMILES CC(C)N1CC(=O)N2[C@H](Cc3c([nH]c4ccccc34)[C@H]2c2ccc3OCOc3c2)C1=O
Show InChI InChI=1S/C24H23N3O4/c1-13(2)26-11-21(28)27-18(24(26)29)10-16-15-5-3-4-6-17(15)25-22(16)23(27)14-7-8-19-20(9-14)31-12-30-19/h3-9,13,18,23,25H,10-12H2,1-2H3/t18-,23-/m1/s1
Reactome pathway
n/an/a 8n/an/an/an/an/an/a
Centre de Recherches
Curated by ChEMBL
Assay Description
In vitro inhibitory activity against bovine phosphodiesterase 5
J Med Chem 46: 4533-42 (2003)
Article DOI: 10.1021/jm0300577
BindingDB Entry DOI: 10.7270/Q2N015X2