BDBM50134324 CHEMBL3747019
SMILES: CN1CCn2nc(Nc3cc(n[nH]c3=O)-c3ccc(C)c(NC(=O)c4cc5ccccc5s4)c3F)cc2C1
InChI Key: InChIKey=OHZNHWDXCHGYRT-UHFFFAOYSA-N
Data: 2 IC50
Activity Spreadsheet -- Enzyme Inhibition Constant Data from BindingDB
Found 2 hits for monomerid = 50134324
Trg + Lig
Ki
nM
ΔG°
kcal/mole
IC50
nM
Kd
nM
EC50/IC50
nM
koff
s-1
kon
M-1s-1
pHTemp
°C
Tyrosine-protein kinase BTK
(Homo sapiens (Human))
BDBM50134324
(CHEMBL3747019)
Show SMILES CN1CCn2nc(Nc3cc(n[nH]c3=O)-c3ccc(C)c(NC(=O)c4cc5ccccc5s4)c3F)cc2C1
Show InChI InChI=1S/C27H24FN7O2S/c1-15-7-8-18(24(28)25(15)30-27(37)22-11-16-5-3-4-6-21(16)38-22)19-13-20(26(36)32-31-19)29-23-12-17-14-34(2)9-10-35(17)33-23/h3-8,11-13H,9-10,14H2,1-2H3,(H,30,37)(H,32,36)(H,29,31,33)
NCI pathway
Reactome pathway
n/an/a 11n/an/an/an/an/an/a
Genentech
Curated by ChEMBL
Assay Description
Inhibition of BTK (unknown origin) by Lanthascreen assay
Bioorg Med Chem Lett 26: 575-9 (2016)
BindingDB Entry DOI: 10.7270/Q2222WMH
Tyrosine-protein kinase BTK
(Mus musculus)
BDBM50134324
(CHEMBL3747019)
Show SMILES CN1CCn2nc(Nc3cc(n[nH]c3=O)-c3ccc(C)c(NC(=O)c4cc5ccccc5s4)c3F)cc2C1
Show InChI InChI=1S/C27H24FN7O2S/c1-15-7-8-18(24(28)25(15)30-27(37)22-11-16-5-3-4-6-21(16)38-22)19-13-20(26(36)32-31-19)29-23-12-17-14-34(2)9-10-35(17)33-23/h3-8,11-13H,9-10,14H2,1-2H3,(H,30,37)(H,32,36)(H,29,31,33)
n/an/a 200n/an/an/an/an/an/a
Genentech
Curated by ChEMBL
Assay Description
Inhibition of BTK in Balb/c mouse B cells assessed as inhibition of anti-IgM-stimulated CD86 expression by flow cytometry
Bioorg Med Chem Lett 26: 575-9 (2016)
BindingDB Entry DOI: 10.7270/Q2222WMH