BDBM50134486 (R)-1,2,3,4-Tetrahydro-isoquinoline-3-carboxylic acid {(R)-1-(4-chloro-benzyl)-2-oxo-2-[4-(2-[1,2,4]triazol-1-ylmethyl-phenyl)-piperazin-1-yl]-ethyl}-amide::(R)-N-((R)-1-(4-(2-((1H-1,2,4-triazol-1-yl)methyl)phenyl)piperazin-1-yl)-3-(4-chlorophenyl)-1-oxopropan-2-yl)-1,2,3,4-tetrahydroisoquinoline-3-carboxamide::1,2,3,4-Tetrahydro-isoquinoline-3-carboxylic acid {(R)-1-(4-chloro-benzyl)-2-oxo-2-[4-(2-[1,2,4]triazol-1-ylmethyl-phenyl)-piperazin-1-yl]-ethyl}-amide::CHEMBL340355
SMILES: Clc1ccc(C[C@@H](NC(=O)[C@H]2Cc3ccccc3CN2)C(=O)N2CCN(CC2)c2ccccc2Cn2cncn2)cc1
InChI Key: InChIKey=PKHOEKKVDQTOOR-FQLXRVMXSA-N
Data: 5 KI  9 EC50
Activity Spreadsheet -- Enzyme Inhibition Constant Data from BindingDB
Found 14 hits for monomerid = 50134486
Trg + Lig
Ki
nM
ΔG°
kcal/mole
IC50
nM
Kd
nM
EC50/IC50
nM
koff
s-1
kon
M-1s-1
pHTemp
°C
Melanocortin receptor 3
(Homo sapiens (Human))
BDBM50134486
((R)-1,2,3,4-Tetrahydro-isoquinoline-3-carboxylic a...)
Show SMILES Clc1ccc(C[C@@H](NC(=O)[C@H]2Cc3ccccc3CN2)C(=O)N2CCN(CC2)c2ccccc2Cn2cncn2)cc1 |r|
Show InChI InChI=1S/C32H34ClN7O2/c33-27-11-9-23(10-12-27)17-29(37-31(41)28-18-24-5-1-2-6-25(24)19-35-28)32(42)39-15-13-38(14-16-39)30-8-4-3-7-26(30)20-40-22-34-21-36-40/h1-12,21-22,28-29,35H,13-20H2,(H,37,41)/t28-,29-/m1/s1
24n/an/an/an/an/an/an/an/a
Neurocrine Biosciences, Inc.
Curated by ChEMBL
Assay Description
Displacement of [125I]-NDP-MSH from HEK293 cells expressing human melanocortin-3 receptor at 10 uM
Bioorg Med Chem Lett 14: 4417-23 (2004)
Article DOI: 10.1016/j.bmcl.2004.06.059
BindingDB Entry DOI: 10.7270/Q2251HPH
Melanocortin receptor 4
(Homo sapiens (Human))
BDBM50134486
((R)-1,2,3,4-Tetrahydro-isoquinoline-3-carboxylic a...)
Show SMILES Clc1ccc(C[C@@H](NC(=O)[C@H]2Cc3ccccc3CN2)C(=O)N2CCN(CC2)c2ccccc2Cn2cncn2)cc1 |r|
Show InChI InChI=1S/C32H34ClN7O2/c33-27-11-9-23(10-12-27)17-29(37-31(41)28-18-24-5-1-2-6-25(24)19-35-28)32(42)39-15-13-38(14-16-39)30-8-4-3-7-26(30)20-40-22-34-21-36-40/h1-12,21-22,28-29,35H,13-20H2,(H,37,41)/t28-,29-/m1/s1
270n/an/an/an/an/an/an/an/a
Neurocrine Biosciences, Inc.
Curated by ChEMBL
Assay Description
Agonist activity at human MC4 receptor expressed in HEK293 cells assessed as stimulation of cAMP production
J Med Chem 47: 6821-30 (2004)
Article DOI: 10.1021/jm049278i
BindingDB Entry DOI: 10.7270/Q2610ZSQ
Melanocortin receptor 4
(Homo sapiens (Human))
BDBM50134486
((R)-1,2,3,4-Tetrahydro-isoquinoline-3-carboxylic a...)
Show SMILES Clc1ccc(C[C@@H](NC(=O)[C@H]2Cc3ccccc3CN2)C(=O)N2CCN(CC2)c2ccccc2Cn2cncn2)cc1 |r|
Show InChI InChI=1S/C32H34ClN7O2/c33-27-11-9-23(10-12-27)17-29(37-31(41)28-18-24-5-1-2-6-25(24)19-35-28)32(42)39-15-13-38(14-16-39)30-8-4-3-7-26(30)20-40-22-34-21-36-40/h1-12,21-22,28-29,35H,13-20H2,(H,37,41)/t28-,29-/m1/s1
270n/an/an/an/an/an/an/an/a
Neurocrine Biosciences, Inc.
Curated by ChEMBL
Assay Description
Displacement of [125I]NDP-MSH from HEK293 cells expressing human melanocortin-4 receptor
Bioorg Med Chem Lett 14: 4417-23 (2004)
Article DOI: 10.1016/j.bmcl.2004.06.059
BindingDB Entry DOI: 10.7270/Q2251HPH
Melanocortin receptor 4
(Homo sapiens (Human))
BDBM50134486
((R)-1,2,3,4-Tetrahydro-isoquinoline-3-carboxylic a...)
Show SMILES Clc1ccc(C[C@@H](NC(=O)[C@H]2Cc3ccccc3CN2)C(=O)N2CCN(CC2)c2ccccc2Cn2cncn2)cc1 |r|
Show InChI InChI=1S/C32H34ClN7O2/c33-27-11-9-23(10-12-27)17-29(37-31(41)28-18-24-5-1-2-6-25(24)19-35-28)32(42)39-15-13-38(14-16-39)30-8-4-3-7-26(30)20-40-22-34-21-36-40/h1-12,21-22,28-29,35H,13-20H2,(H,37,41)/t28-,29-/m1/s1
270n/an/an/an/an/an/an/an/a
Neurocrine Biosciences, Inc.
Curated by ChEMBL
Assay Description
Binding affinity to human MC4 receptor
Bioorg Med Chem Lett 18: 4817-22 (2008)
Article DOI: 10.1016/j.bmcl.2008.07.076
BindingDB Entry DOI: 10.7270/Q24T6J75
Melanocortin receptor 5 (MC5R)
(Homo sapiens (Human))
BDBM50134486
((R)-1,2,3,4-Tetrahydro-isoquinoline-3-carboxylic a...)
Show SMILES Clc1ccc(C[C@@H](NC(=O)[C@H]2Cc3ccccc3CN2)C(=O)N2CCN(CC2)c2ccccc2Cn2cncn2)cc1 |r|
Show InChI InChI=1S/C32H34ClN7O2/c33-27-11-9-23(10-12-27)17-29(37-31(41)28-18-24-5-1-2-6-25(24)19-35-28)32(42)39-15-13-38(14-16-39)30-8-4-3-7-26(30)20-40-22-34-21-36-40/h1-12,21-22,28-29,35H,13-20H2,(H,37,41)/t28-,29-/m1/s1
1.20E+3n/an/an/an/an/an/an/an/a
Neurocrine Biosciences, Inc.
Curated by ChEMBL
Assay Description
Displacement of [125I]NDP-MSH from HEK293 cells expressing human melanocortin-5 receptor
Bioorg Med Chem Lett 14: 4417-23 (2004)
Article DOI: 10.1016/j.bmcl.2004.06.059
BindingDB Entry DOI: 10.7270/Q2251HPH
Melanocortin receptor 5 (MC5R)
(Homo sapiens (Human))
BDBM50134486
((R)-1,2,3,4-Tetrahydro-isoquinoline-3-carboxylic a...)
Show SMILES Clc1ccc(C[C@@H](NC(=O)[C@H]2Cc3ccccc3CN2)C(=O)N2CCN(CC2)c2ccccc2Cn2cncn2)cc1 |r|
Show InChI InChI=1S/C32H34ClN7O2/c33-27-11-9-23(10-12-27)17-29(37-31(41)28-18-24-5-1-2-6-25(24)19-35-28)32(42)39-15-13-38(14-16-39)30-8-4-3-7-26(30)20-40-22-34-21-36-40/h1-12,21-22,28-29,35H,13-20H2,(H,37,41)/t28-,29-/m1/s1
n/an/an/an/a>3.00E+3n/an/an/an/a
Neurocrine Biosciences Inc.
Curated by ChEMBL
Assay Description
In vitro cAMP accumulation in HEK cells transfected with human Melanocortin 5 receptor (hMC5R)
Bioorg Med Chem Lett 13: 3793-6 (2003)
BindingDB Entry DOI: 10.7270/Q2P26ZNW
Melanocortin receptor 4
(Homo sapiens (Human))
BDBM50134486
((R)-1,2,3,4-Tetrahydro-isoquinoline-3-carboxylic a...)
Show SMILES Clc1ccc(C[C@@H](NC(=O)[C@H]2Cc3ccccc3CN2)C(=O)N2CCN(CC2)c2ccccc2Cn2cncn2)cc1 |r|
Show InChI InChI=1S/C32H34ClN7O2/c33-27-11-9-23(10-12-27)17-29(37-31(41)28-18-24-5-1-2-6-25(24)19-35-28)32(42)39-15-13-38(14-16-39)30-8-4-3-7-26(30)20-40-22-34-21-36-40/h1-12,21-22,28-29,35H,13-20H2,(H,37,41)/t28-,29-/m1/s1
n/an/an/an/a 80n/an/an/an/a
Neurocrine Biosciences Inc.
Curated by ChEMBL
Assay Description
Agonistic activity measured as inhibition of cAMP accumulation in HEK cells expressing human Melanocortin 4 receptor (hMC4R)
Bioorg Med Chem Lett 13: 3793-6 (2003)
BindingDB Entry DOI: 10.7270/Q2P26ZNW
Melanocyte-stimulating hormone receptor
(Homo sapiens (Human))
BDBM50134486
((R)-1,2,3,4-Tetrahydro-isoquinoline-3-carboxylic a...)
Show SMILES Clc1ccc(C[C@@H](NC(=O)[C@H]2Cc3ccccc3CN2)C(=O)N2CCN(CC2)c2ccccc2Cn2cncn2)cc1 |r|
Show InChI InChI=1S/C32H34ClN7O2/c33-27-11-9-23(10-12-27)17-29(37-31(41)28-18-24-5-1-2-6-25(24)19-35-28)32(42)39-15-13-38(14-16-39)30-8-4-3-7-26(30)20-40-22-34-21-36-40/h1-12,21-22,28-29,35H,13-20H2,(H,37,41)/t28-,29-/m1/s1
n/an/an/an/a>3.00E+3n/an/an/an/a
Neurocrine Biosciences Inc.
Curated by ChEMBL
Assay Description
In vitro cAMP accumulation in HEK cells transfected with human Melanocortin 1 receptor (hMC1R)
Bioorg Med Chem Lett 13: 3793-6 (2003)
BindingDB Entry DOI: 10.7270/Q2P26ZNW
Melanocortin receptor 2
(Mus musculus)
BDBM50134486
((R)-1,2,3,4-Tetrahydro-isoquinoline-3-carboxylic a...)
Show SMILES Clc1ccc(C[C@@H](NC(=O)[C@H]2Cc3ccccc3CN2)C(=O)N2CCN(CC2)c2ccccc2Cn2cncn2)cc1 |r|
Show InChI InChI=1S/C32H34ClN7O2/c33-27-11-9-23(10-12-27)17-29(37-31(41)28-18-24-5-1-2-6-25(24)19-35-28)32(42)39-15-13-38(14-16-39)30-8-4-3-7-26(30)20-40-22-34-21-36-40/h1-12,21-22,28-29,35H,13-20H2,(H,37,41)/t28-,29-/m1/s1
Reactome pathway
n/an/an/an/a>1.00E+4n/an/an/an/a
Neurocrine Biosciences Inc.
Curated by ChEMBL
Assay Description
In vitro cAMP accumulation in Y1 cells transfected with mouse Melanocortin 2 receptor (mMC2R)
Bioorg Med Chem Lett 13: 3793-6 (2003)
BindingDB Entry DOI: 10.7270/Q2P26ZNW
Melanocortin receptor 4
(Mus musculus)
BDBM50134486
((R)-1,2,3,4-Tetrahydro-isoquinoline-3-carboxylic a...)
Show SMILES Clc1ccc(C[C@@H](NC(=O)[C@H]2Cc3ccccc3CN2)C(=O)N2CCN(CC2)c2ccccc2Cn2cncn2)cc1 |r|
Show InChI InChI=1S/C32H34ClN7O2/c33-27-11-9-23(10-12-27)17-29(37-31(41)28-18-24-5-1-2-6-25(24)19-35-28)32(42)39-15-13-38(14-16-39)30-8-4-3-7-26(30)20-40-22-34-21-36-40/h1-12,21-22,28-29,35H,13-20H2,(H,37,41)/t28-,29-/m1/s1
n/an/an/an/a 59n/an/an/an/a
Neurocrine Biosciences Inc.
Curated by ChEMBL
Assay Description
In vitro cAMP accumulation in Y1 cells transfected with mouse Melanocortin 4 receptor (mMC4R)
Bioorg Med Chem Lett 13: 3793-6 (2003)
BindingDB Entry DOI: 10.7270/Q2P26ZNW
Melanocortin receptor 4
(Homo sapiens (Human))
BDBM50134486
((R)-1,2,3,4-Tetrahydro-isoquinoline-3-carboxylic a...)
Show SMILES Clc1ccc(C[C@@H](NC(=O)[C@H]2Cc3ccccc3CN2)C(=O)N2CCN(CC2)c2ccccc2Cn2cncn2)cc1 |r|
Show InChI InChI=1S/C32H34ClN7O2/c33-27-11-9-23(10-12-27)17-29(37-31(41)28-18-24-5-1-2-6-25(24)19-35-28)32(42)39-15-13-38(14-16-39)30-8-4-3-7-26(30)20-40-22-34-21-36-40/h1-12,21-22,28-29,35H,13-20H2,(H,37,41)/t28-,29-/m1/s1
n/an/an/an/a 80n/an/an/an/a
Neurocrine Biosciences, Inc.
Curated by ChEMBL
Assay Description
Effective concentration against cAMP release in CHO cells expressing human melanocortin-4 receptor
Bioorg Med Chem Lett 14: 4417-23 (2004)
Article DOI: 10.1016/j.bmcl.2004.06.059
BindingDB Entry DOI: 10.7270/Q2251HPH
Melanocortin receptor 4
(Homo sapiens (Human))
BDBM50134486
((R)-1,2,3,4-Tetrahydro-isoquinoline-3-carboxylic a...)
Show SMILES Clc1ccc(C[C@@H](NC(=O)[C@H]2Cc3ccccc3CN2)C(=O)N2CCN(CC2)c2ccccc2Cn2cncn2)cc1 |r|
Show InChI InChI=1S/C32H34ClN7O2/c33-27-11-9-23(10-12-27)17-29(37-31(41)28-18-24-5-1-2-6-25(24)19-35-28)32(42)39-15-13-38(14-16-39)30-8-4-3-7-26(30)20-40-22-34-21-36-40/h1-12,21-22,28-29,35H,13-20H2,(H,37,41)/t28-,29-/m1/s1
n/an/an/an/a 110n/an/an/an/a
Neurocrine Biosciences, Inc.
Curated by ChEMBL
Assay Description
Agonist activity at human MC4 receptor expressed in HEK293 cells assessed as stimulation of cAMP production
J Med Chem 47: 6821-30 (2004)
Article DOI: 10.1021/jm049278i
BindingDB Entry DOI: 10.7270/Q2610ZSQ
Melanocortin receptor 3
(Homo sapiens (Human))
BDBM50134486
((R)-1,2,3,4-Tetrahydro-isoquinoline-3-carboxylic a...)
Show SMILES Clc1ccc(C[C@@H](NC(=O)[C@H]2Cc3ccccc3CN2)C(=O)N2CCN(CC2)c2ccccc2Cn2cncn2)cc1 |r|
Show InChI InChI=1S/C32H34ClN7O2/c33-27-11-9-23(10-12-27)17-29(37-31(41)28-18-24-5-1-2-6-25(24)19-35-28)32(42)39-15-13-38(14-16-39)30-8-4-3-7-26(30)20-40-22-34-21-36-40/h1-12,21-22,28-29,35H,13-20H2,(H,37,41)/t28-,29-/m1/s1
n/an/an/an/a>3.00E+3n/an/an/an/a
Neurocrine Biosciences Inc.
Curated by ChEMBL
Assay Description
In vitro cAMP accumulation in HEK cells transfected with human Melanocortin 3 receptor (hMC3R)
Bioorg Med Chem Lett 13: 3793-6 (2003)
BindingDB Entry DOI: 10.7270/Q2P26ZNW
Melanocortin receptor 4
(Homo sapiens (Human))
BDBM50134486
((R)-1,2,3,4-Tetrahydro-isoquinoline-3-carboxylic a...)
Show SMILES Clc1ccc(C[C@@H](NC(=O)[C@H]2Cc3ccccc3CN2)C(=O)N2CCN(CC2)c2ccccc2Cn2cncn2)cc1 |r|
Show InChI InChI=1S/C32H34ClN7O2/c33-27-11-9-23(10-12-27)17-29(37-31(41)28-18-24-5-1-2-6-25(24)19-35-28)32(42)39-15-13-38(14-16-39)30-8-4-3-7-26(30)20-40-22-34-21-36-40/h1-12,21-22,28-29,35H,13-20H2,(H,37,41)/t28-,29-/m1/s1
n/an/an/an/a 80n/an/an/an/a
Neurocrine Biosciences, Inc.
Curated by ChEMBL
Assay Description
Effective concentration against cAMP release in CHO cells expressing human melanocortin-4 receptor
Bioorg Med Chem Lett 14: 4417-23 (2004)
Article DOI: 10.1016/j.bmcl.2004.06.059
BindingDB Entry DOI: 10.7270/Q2251HPH