null
SMILES: NC(=O)c1ccc(cc1)-c1cncc(c1)-c1ccc(Cl)cc1
InChI Key: InChIKey=ZZSBCDINHVSRJC-UHFFFAOYSA-N
Activity Spreadsheet -- Enzyme Inhibition Constant Data from BindingDB
Found 2 hits for monomerid = 50134774
Trg + Lig
Ki
nM
ΔG°
kcal/mole
IC50
nM
Kd
nM
EC50/IC50
nM
koff
s-1
kon
M-1s-1
pHTemp
°C
Mitogen-activated protein kinase kinase kinase kinase 4
(Homo sapiens (Human))
BDBM50134774
(CHEMBL3754588)
Show SMILES NC(=O)c1ccc(cc1)-c1cncc(c1)-c1ccc(Cl)cc1
Show InChI InChI=1S/C18H13ClN2O/c19-17-7-5-13(6-8-17)16-9-15(10-21-11-16)12-1-3-14(4-2-12)18(20)22/h1-11H,(H2,20,22)
NCI pathway
Reactome pathway
n/an/a 7.50E+3n/an/an/an/an/an/a
Pfizer Inc.
Curated by ChEMBL
Assay Description
Inhibition of human MAP4K4 transfected in 293 MSR cells assessed as inhibition of phosphorylation of traf2 at ser/thr residue by ELISA
ACS Med Chem Lett 6: 1128-33 (2015)
BindingDB Entry DOI: 10.7270/Q2028TC6
Mitogen-activated protein kinase kinase kinase kinase 4
(Homo sapiens (Human))
BDBM50134774
(CHEMBL3754588)
Show SMILES NC(=O)c1ccc(cc1)-c1cncc(c1)-c1ccc(Cl)cc1
Show InChI InChI=1S/C18H13ClN2O/c19-17-7-5-13(6-8-17)16-9-15(10-21-11-16)12-1-3-14(4-2-12)18(20)22/h1-11H,(H2,20,22)
NCI pathway
Reactome pathway
n/an/a 46n/an/an/an/an/an/a
Pfizer Inc.
Curated by ChEMBL
Assay Description
Inhibition of recombinant human MAP4K4 catalytic domain in presence of 10 uM ATP (Km) by FRET assay
ACS Med Chem Lett 6: 1128-33 (2015)
BindingDB Entry DOI: 10.7270/Q2028TC6