null
SMILES: FC(F)(F)c1cc(N2CCN(CC2)C(=O)Nc2ccc(Oc3ccccc3)cc2)c2ccccc2n1
InChI Key: InChIKey=DPDIVGZIOZSXON-UHFFFAOYSA-N
Activity Spreadsheet -- Enzyme Inhibition Constant Data from BindingDB
Found 1 hit for monomerid = 50134849
Trg + Lig
Ki
nM
ΔG°
kcal/mole
IC50
nM
Kd
nM
EC50/IC50
nM
koff
s-1
kon
M-1s-1
pHTemp
°C
Platelet-derived growth factor receptor beta
(Homo sapiens (Human))
BDBM50134849
(4-(2-Trifluoromethyl-quinolin-4-yl)-piperazine-1-c...)
Show SMILES FC(F)(F)c1cc(N2CCN(CC2)C(=O)Nc2ccc(Oc3ccccc3)cc2)c2ccccc2n1
Show InChI InChI=1S/C27H23F3N4O2/c28-27(29,30)25-18-24(22-8-4-5-9-23(22)32-25)33-14-16-34(17-15-33)26(35)31-19-10-12-21(13-11-19)36-20-6-2-1-3-7-20/h1-13,18H,14-17H2,(H,31,35)
NCI pathway
Reactome pathway
n/an/a>3.00E+4n/an/an/an/an/an/a
Pharmaceutical Research Institute
Curated by ChEMBL
Assay Description
Inhibition of platelet-derived growth factor receptor beta phosphorylation was measured in intact cells using a two-site enzyme linked immunosorbent ...
J Med Chem 46: 4910-25 (2003)
Article DOI: 10.1021/jm020505v
BindingDB Entry DOI: 10.7270/Q2X929PJ