null
SMILES: CCn1nnc2cc3c(ncnc3cc12)N1CCN(CC1)C(=O)Nc1ccc(Oc2ccccc2)cc1
InChI Key: InChIKey=FZLKPHLTQNXTDH-UHFFFAOYSA-N
Activity Spreadsheet -- Enzyme Inhibition Constant Data from BindingDB
Found 1 hit for monomerid = 50134870
Trg + Lig
Ki
nM
ΔG°
kcal/mole
IC50
nM
Kd
nM
EC50/IC50
nM
koff
s-1
kon
M-1s-1
pHTemp
°C
Platelet-derived growth factor receptor beta
(Homo sapiens (Human))
BDBM50134870
(4-(3-Ethyl-3H-1,2,3,5,7-pentaaza-cyclopenta[b]naph...)
Show SMILES CCn1nnc2cc3c(ncnc3cc12)N1CCN(CC1)C(=O)Nc1ccc(Oc2ccccc2)cc1
Show InChI InChI=1S/C27H26N8O2/c1-2-35-25-17-23-22(16-24(25)31-32-35)26(29-18-28-23)33-12-14-34(15-13-33)27(36)30-19-8-10-21(11-9-19)37-20-6-4-3-5-7-20/h3-11,16-18H,2,12-15H2,1H3,(H,30,36)
NCI pathway
Reactome pathway
n/an/a 290n/an/an/an/an/an/a
Pharmaceutical Research Institute
Curated by ChEMBL
Assay Description
Inhibition of platelet-derived growth factor receptor beta phosphorylation was measured in intact cells using a two-site enzyme linked immunosorbent ...
J Med Chem 46: 4910-25 (2003)
Article DOI: 10.1021/jm020505v
BindingDB Entry DOI: 10.7270/Q2X929PJ