null
SMILES: Nc1nc(N2CCN(CC2)C(=O)Nc2ccc(Oc3ccccc3)cc2)c2[nH]cnc2n1
InChI Key: InChIKey=QAZUBKHRVWTMMY-UHFFFAOYSA-N
Activity Spreadsheet -- Enzyme Inhibition Constant Data from BindingDB
Found 1 hit for monomerid = 50134886
Trg + Lig
Ki
nM
ΔG°
kcal/mole
IC50
nM
Kd
nM
EC50/IC50
nM
koff
s-1
kon
M-1s-1
pHTemp
°C
Platelet-derived growth factor receptor beta
(Homo sapiens (Human))
BDBM50134886
(4-(2-Amino-9H-purin-6-yl)-piperazine-1-carboxylic ...)
Show SMILES Nc1nc(N2CCN(CC2)C(=O)Nc2ccc(Oc3ccccc3)cc2)c2[nH]cnc2n1
Show InChI InChI=1S/C22H22N8O2/c23-21-27-19-18(24-14-25-19)20(28-21)29-10-12-30(13-11-29)22(31)26-15-6-8-17(9-7-15)32-16-4-2-1-3-5-16/h1-9,14H,10-13H2,(H,26,31)(H3,23,24,25,27,28)
NCI pathway
Reactome pathway
n/an/a 1.50E+3n/an/an/an/an/an/a
Pharmaceutical Research Institute
Curated by ChEMBL
Assay Description
Inhibition of platelet-derived growth factor receptor beta phosphorylation was measured in intact cells using a two-site enzyme linked immunosorbent ...
J Med Chem 46: 4910-25 (2003)
Article DOI: 10.1021/jm020505v
BindingDB Entry DOI: 10.7270/Q2X929PJ