null
SMILES: Cn1cnc2c(ncnc12)N1CCN(CC1)C(=O)Nc1ccc(Oc2ccccc2)cc1
InChI Key: InChIKey=JNYHRUVUEFUAOK-UHFFFAOYSA-N
Activity Spreadsheet -- Enzyme Inhibition Constant Data from BindingDB
Found 1 hit for monomerid = 50134890
Trg + Lig
Ki
nM
ΔG°
kcal/mole
IC50
nM
Kd
nM
EC50/IC50
nM
koff
s-1
kon
M-1s-1
pHTemp
°C
Platelet-derived growth factor receptor beta
(Homo sapiens (Human))
BDBM50134890
(4-(9-Methyl-9H-purin-6-yl)-piperazine-1-carboxylic...)
Show SMILES Cn1cnc2c(ncnc12)N1CCN(CC1)C(=O)Nc1ccc(Oc2ccccc2)cc1
Show InChI InChI=1S/C23H23N7O2/c1-28-16-26-20-21(28)24-15-25-22(20)29-11-13-30(14-12-29)23(31)27-17-7-9-19(10-8-17)32-18-5-3-2-4-6-18/h2-10,15-16H,11-14H2,1H3,(H,27,31)
NCI pathway
Reactome pathway
n/an/a>3.00E+4n/an/an/an/an/an/a
Pharmaceutical Research Institute
Curated by ChEMBL
Assay Description
Inhibition of platelet-derived growth factor receptor beta phosphorylation was measured in intact cells using a two-site enzyme linked immunosorbent ...
J Med Chem 46: 4910-25 (2003)
Article DOI: 10.1021/jm020505v
BindingDB Entry DOI: 10.7270/Q2X929PJ