null
SMILES: NC(=O)c1c(Nc2ccc(I)cc2F)cc(F)cc1Oc1cccc(NS(N)(=O)=O)c1Cl
InChI Key: InChIKey=SPLFQDSWYQVQLH-UHFFFAOYSA-N
Activity Spreadsheet -- Enzyme Inhibition Constant Data from BindingDB
Found 2 hits for monomerid = 50134939
Trg + Lig
Ki
nM
ΔG°
kcal/mole
IC50
nM
Kd
nM
EC50/IC50
nM
koff
s-1
kon
M-1s-1
pHTemp
°C
Carbonic anhydrase 2
(Homo sapiens (Human))
BDBM50134939
(CHEMBL3747359)
Show SMILES NC(=O)c1c(Nc2ccc(I)cc2F)cc(F)cc1Oc1cccc(NS(N)(=O)=O)c1Cl
Show InChI InChI=1S/C19H14ClF2IN4O4S/c20-18-13(27-32(25,29)30)2-1-3-15(18)31-16-7-9(21)6-14(17(16)19(24)28)26-12-5-4-10(23)8-11(12)22/h1-8,26-27H,(H2,24,28)(H2,25,29,30)
Reactome pathway
n/an/a 700n/an/an/an/an/an/a
Bayer HealthCare AG
Curated by ChEMBL
Assay Description
Inhibition of human carbonic anhydrase 2
Bioorg Med Chem Lett 26: 186-93 (2015)
BindingDB Entry DOI: 10.7270/Q26M38NN
Dual specificity mitogen-activated protein kinase kinase 1
(Homo sapiens (Human))
BDBM50134939
(CHEMBL3747359)
Show SMILES NC(=O)c1c(Nc2ccc(I)cc2F)cc(F)cc1Oc1cccc(NS(N)(=O)=O)c1Cl
Show InChI InChI=1S/C19H14ClF2IN4O4S/c20-18-13(27-32(25,29)30)2-1-3-15(18)31-16-7-9(21)6-14(17(16)19(24)28)26-12-5-4-10(23)8-11(12)22/h1-8,26-27H,(H2,24,28)(H2,25,29,30)
Reactome pathway
n/an/a 18n/an/an/an/an/an/a
Bayer HealthCare AG
Curated by ChEMBL
Assay Description
Inhibition of MEK1 (unknown origin) using biotinylated ERK1 as substrate incubated for 2 hrs by fluorescence analysis
Bioorg Med Chem Lett 26: 186-93 (2015)
BindingDB Entry DOI: 10.7270/Q26M38NN