BDBM50135356 6-[(2'-Chloro-6-cyano-biphenyl-3-yl)-(3-methyl-3H-imidazol-4-yl)-methoxymethyl]-1-methyl-2-oxo-5-(4-trifluoromethoxy-phenyl)-1,2-dihydro-pyridine-3-carbonitrile::CHEMBL128018
SMILES: Cn1cncc1C(OCc1c(cc(C#N)c(=O)n1C)-c1ccc(OC(F)(F)F)cc1)c1ccc(C#N)c(c1)-c1ccccc1Cl
InChI Key: InChIKey=ZAUBGERWKXAZHI-UHFFFAOYSA-N
Data: 2 IC50  1 EC50
Activity Spreadsheet -- Enzyme Inhibition Constant Data from BindingDB
Found 3 hits for monomerid = 50135356
Trg + Lig
Ki
nM
ΔG°
kcal/mole
IC50
nM
Kd
nM
EC50/IC50
nM
koff
s-1
kon
M-1s-1
pHTemp
°C
Protein Farnesyltransferase (PFT)
(Homo sapiens (Human))
BDBM50135356
(6-[(2'-Chloro-6-cyano-biphenyl-3-yl)-(3-methyl-3H-...)
Show SMILES Cn1cncc1C(OCc1c(cc(C#N)c(=O)n1C)-c1ccc(OC(F)(F)F)cc1)c1ccc(C#N)c(c1)-c1ccccc1Cl
Show InChI InChI=1S/C33H23ClF3N5O3/c1-41-19-40-17-29(41)31(21-7-8-22(15-38)26(13-21)25-5-3-4-6-28(25)34)44-18-30-27(14-23(16-39)32(43)42(30)2)20-9-11-24(12-10-20)45-33(35,36)37/h3-14,17,19,31H,18H2,1-2H3
Reactome pathway
n/an/an/an/a>100n/an/an/an/a
Abbott Laboratories
Curated by ChEMBL
Assay Description
In vitro effective concentration of the compound against farnesyltransferase (FT)
Bioorg Med Chem Lett 13: 4001-5 (2003)
BindingDB Entry DOI: 10.7270/Q2H41QVX
Geranylgeranyl transferase type I beta subunit/Protein Farnesyltransferase (PFT)
(Homo sapiens (Human))
BDBM50135356
(6-[(2'-Chloro-6-cyano-biphenyl-3-yl)-(3-methyl-3H-...)
Show SMILES Cn1cncc1C(OCc1c(cc(C#N)c(=O)n1C)-c1ccc(OC(F)(F)F)cc1)c1ccc(C#N)c(c1)-c1ccccc1Cl
Show InChI InChI=1S/C33H23ClF3N5O3/c1-41-19-40-17-29(41)31(21-7-8-22(15-38)26(13-21)25-5-3-4-6-28(25)34)44-18-30-27(14-23(16-39)32(43)42(30)2)20-9-11-24(12-10-20)45-33(35,36)37/h3-14,17,19,31H,18H2,1-2H3
n/an/a 110n/an/an/an/an/an/a
Abbott Laboratories
Curated by ChEMBL
Assay Description
In vitro inhibitory activity of the compound against Geranylgeranyl transferase type I
Bioorg Med Chem Lett 13: 4001-5 (2003)
BindingDB Entry DOI: 10.7270/Q2H41QVX
Protein Farnesyltransferase (PFT)
(Homo sapiens (Human))
BDBM50135356
(6-[(2'-Chloro-6-cyano-biphenyl-3-yl)-(3-methyl-3H-...)
Show SMILES Cn1cncc1C(OCc1c(cc(C#N)c(=O)n1C)-c1ccc(OC(F)(F)F)cc1)c1ccc(C#N)c(c1)-c1ccccc1Cl
Show InChI InChI=1S/C33H23ClF3N5O3/c1-41-19-40-17-29(41)31(21-7-8-22(15-38)26(13-21)25-5-3-4-6-28(25)34)44-18-30-27(14-23(16-39)32(43)42(30)2)20-9-11-24(12-10-20)45-33(35,36)37/h3-14,17,19,31H,18H2,1-2H3
Reactome pathway
n/an/a 3.90n/an/an/an/an/an/a
Abbott Laboratories
Curated by ChEMBL
Assay Description
In vitro inhibitory activity against farnesyltransferase (FT)
Bioorg Med Chem Lett 13: 4001-5 (2003)
BindingDB Entry DOI: 10.7270/Q2H41QVX