BDBM50135368 5-(3-Chloro-5-fluoro-phenyl)-6-[(4-cyano-phenyl)-(3-methyl-3H-imidazol-4-yl)-methoxymethyl]-1-methyl-2-oxo-1,2-dihydro-pyridine-3-carbonitrile::CHEMBL131609
SMILES: Cn1cncc1C(OCc1c(cc(C#N)c(=O)n1C)-c1cc(F)cc(Cl)c1)c1ccc(cc1)C#N
InChI Key: InChIKey=YHZAWDJTCMTRQA-UHFFFAOYSA-N
Data: 2 IC50  1 EC50
Activity Spreadsheet -- Enzyme Inhibition Constant Data from BindingDB
Found 3 hits for monomerid = 50135368
Trg + Lig
Ki
nM
ΔG°
kcal/mole
IC50
nM
Kd
nM
EC50/IC50
nM
koff
s-1
kon
M-1s-1
pHTemp
°C
Protein Farnesyltransferase (PFT)
(Homo sapiens (Human))
BDBM50135368
(5-(3-Chloro-5-fluoro-phenyl)-6-[(4-cyano-phenyl)-(...)
Show SMILES Cn1cncc1C(OCc1c(cc(C#N)c(=O)n1C)-c1cc(F)cc(Cl)c1)c1ccc(cc1)C#N
Show InChI InChI=1S/C26H19ClFN5O2/c1-32-15-31-13-23(32)25(17-5-3-16(11-29)4-6-17)35-14-24-22(9-19(12-30)26(34)33(24)2)18-7-20(27)10-21(28)8-18/h3-10,13,15,25H,14H2,1-2H3
Reactome pathway
n/an/an/an/a 17n/an/an/an/a
Abbott Laboratories
Curated by ChEMBL
Assay Description
In vitro effective concentration of the compound against farnesyltransferase (FT)
Bioorg Med Chem Lett 13: 4001-5 (2003)
BindingDB Entry DOI: 10.7270/Q2H41QVX
Geranylgeranyl transferase type I beta subunit/Protein Farnesyltransferase (PFT)
(Homo sapiens (Human))
BDBM50135368
(5-(3-Chloro-5-fluoro-phenyl)-6-[(4-cyano-phenyl)-(...)
Show SMILES Cn1cncc1C(OCc1c(cc(C#N)c(=O)n1C)-c1cc(F)cc(Cl)c1)c1ccc(cc1)C#N
Show InChI InChI=1S/C26H19ClFN5O2/c1-32-15-31-13-23(32)25(17-5-3-16(11-29)4-6-17)35-14-24-22(9-19(12-30)26(34)33(24)2)18-7-20(27)10-21(28)8-18/h3-10,13,15,25H,14H2,1-2H3
n/an/a 1.80E+3n/an/an/an/an/an/a
Abbott Laboratories
Curated by ChEMBL
Assay Description
In vitro inhibitory activity of the compound against Geranylgeranyl transferase type I
Bioorg Med Chem Lett 13: 4001-5 (2003)
BindingDB Entry DOI: 10.7270/Q2H41QVX
Protein Farnesyltransferase (PFT)
(Homo sapiens (Human))
BDBM50135368
(5-(3-Chloro-5-fluoro-phenyl)-6-[(4-cyano-phenyl)-(...)
Show SMILES Cn1cncc1C(OCc1c(cc(C#N)c(=O)n1C)-c1cc(F)cc(Cl)c1)c1ccc(cc1)C#N
Show InChI InChI=1S/C26H19ClFN5O2/c1-32-15-31-13-23(32)25(17-5-3-16(11-29)4-6-17)35-14-24-22(9-19(12-30)26(34)33(24)2)18-7-20(27)10-21(28)8-18/h3-10,13,15,25H,14H2,1-2H3
Reactome pathway
n/an/a 0.700n/an/an/an/an/an/a
Abbott Laboratories
Curated by ChEMBL
Assay Description
In vitro inhibitory activity against farnesyltransferase (FT)
Bioorg Med Chem Lett 13: 4001-5 (2003)
BindingDB Entry DOI: 10.7270/Q2H41QVX